hadoop-mapreduce-dev mailing list archives

Site index · List index
Message view « Date » · « Thread »
Top « Date » · « Thread »
From Apache Jenkins Server <jenk...@builds.apache.org>
Subject Hadoop-Mapreduce-trunk - Build # 1040 - Still Failing
Date Wed, 04 Apr 2012 14:13:26 GMT
See https://builds.apache.org/job/Hadoop-Mapreduce-trunk/1040/

###################################################################################
########################## LAST 60 LINES OF THE CONSOLE ###########################
[...truncated 28894 lines...]
[INFO] 
[INFO] hadoop-yarn ....................................... SUCCESS [1.722s]
[INFO] hadoop-yarn-api ................................... SUCCESS [8.284s]
[INFO] hadoop-yarn-common ................................ SUCCESS [29.307s]
[INFO] hadoop-yarn-server ................................ SUCCESS [0.109s]
[INFO] hadoop-yarn-server-common ......................... SUCCESS [4.171s]
[INFO] hadoop-yarn-server-nodemanager .................... SUCCESS [2:05.546s]
[INFO] hadoop-yarn-server-web-proxy ...................... SUCCESS [1.233s]
[INFO] hadoop-yarn-server-resourcemanager ................ SUCCESS [3:17.796s]
[INFO] hadoop-yarn-server-tests .......................... SUCCESS [40.349s]
[INFO] hadoop-mapreduce-client ........................... SUCCESS [0.060s]
[INFO] hadoop-mapreduce-client-core ...................... SUCCESS [9.370s]
[INFO] hadoop-yarn-applications .......................... SUCCESS [0.085s]
[INFO] hadoop-yarn-applications-distributedshell ......... SUCCESS [22.371s]
[INFO] hadoop-yarn-site .................................. SUCCESS [0.140s]
[INFO] hadoop-mapreduce-client-common .................... SUCCESS [18.757s]
[INFO] hadoop-mapreduce-client-shuffle ................... SUCCESS [1.026s]
[INFO] hadoop-mapreduce-client-app ....................... SUCCESS [4:07.331s]
[INFO] hadoop-mapreduce-client-hs ........................ SUCCESS [1:07.157s]
[INFO] hadoop-mapreduce-client-jobclient ................. FAILURE [41:55.773s]
[INFO] Apache Hadoop MapReduce Examples .................. SKIPPED
[INFO] hadoop-mapreduce .................................. SKIPPED
[INFO] ------------------------------------------------------------------------
[INFO] BUILD FAILURE
[INFO] ------------------------------------------------------------------------
[INFO] Total time: 54:51.599s
[INFO] Finished at: Wed Apr 04 14:12:24 UTC 2012
[INFO] Final Memory: 89M/370M
[INFO] ------------------------------------------------------------------------
[ERROR] Failed to execute goal org.apache.maven.plugins:maven-surefire-plugin:2.10:test (default-test)
on project hadoop-mapreduce-client-jobclient: Failure or timeout -> [Help 1]
[ERROR] 
[ERROR] To see the full stack trace of the errors, re-run Maven with the -e switch.
[ERROR] Re-run Maven using the -X switch to enable full debug logging.
[ERROR] 
[ERROR] For more information about the errors and possible solutions, please read the following
articles:
[ERROR] [Help 1] http://cwiki.apache.org/confluence/display/MAVEN/MojoExecutionException
[ERROR] 
[ERROR] After correcting the problems, you can resume the build with the command
[ERROR]   mvn <goals> -rf :hadoop-mapreduce-client-jobclient
Build step 'Execute shell' marked build as failure
[FINDBUGS] Skipping publisher since build result is FAILURE
Archiving artifacts
Updating MAPREDUCE-3988
Updating MAPREDUCE-3999
Updating MAPREDUCE-4012
Updating HADOOP-8243
Updating HDFS-3176
Updating HDFS-3168
Updating HDFS-3000
Updating HDFS-3187
Updating HDFS-3166
Updating MAPREDUCE-4020
Updating MAPREDUCE-4062
Updating MAPREDUCE-4060
Updating HADOOP-8007
Updating MAPREDUCE-4072
Updating MAPREDUCE-3983
Email was triggered for: Failure
Sending email for trigger: Failure



###################################################################################
############################## FAILED TESTS (if any) ##############################
No tests ran.
Mime
  • Unnamed multipart/mixed (inline, None, 0 bytes)
View raw message