hadoop-mapreduce-dev mailing list archives

Site index · List index
Message view « Date » · « Thread »
Top « Date » · « Thread »
From Apache Jenkins Server <jenk...@builds.apache.org>
Subject Hadoop-Mapreduce-trunk - Build # 1038 - Still Failing
Date Mon, 02 Apr 2012 14:12:35 GMT
See https://builds.apache.org/job/Hadoop-Mapreduce-trunk/1038/

###################################################################################
########################## LAST 60 LINES OF THE CONSOLE ###########################
[...truncated 28397 lines...]
  testCustomAbort(org.apache.hadoop.mapreduce.lib.output.TestJobOutputCommitter): Failed to
Start org.apache.hadoop.mapred.MiniMRCluster
  testCustomCleanup(org.apache.hadoop.mapreduce.lib.output.TestJobOutputCommitter): Failed
to Start org.apache.hadoop.mapred.MiniMRCluster
  testChild(org.apache.hadoop.mapreduce.TestChild): Failed to Start org.apache.hadoop.mapred.MiniMRCluster

Tests run: 404, Failures: 14, Errors: 11, Skipped: 22

[INFO] ------------------------------------------------------------------------
[INFO] Reactor Summary:
[INFO] 
[INFO] hadoop-yarn ....................................... SUCCESS [1.687s]
[INFO] hadoop-yarn-api ................................... SUCCESS [8.460s]
[INFO] hadoop-yarn-common ................................ SUCCESS [25.407s]
[INFO] hadoop-yarn-server ................................ SUCCESS [0.112s]
[INFO] hadoop-yarn-server-common ......................... SUCCESS [4.110s]
[INFO] hadoop-yarn-server-nodemanager .................... SUCCESS [2:05.242s]
[INFO] hadoop-yarn-server-web-proxy ...................... SUCCESS [1.214s]
[INFO] hadoop-yarn-server-resourcemanager ................ SUCCESS [3:14.663s]
[INFO] hadoop-yarn-server-tests .......................... SUCCESS [41.325s]
[INFO] hadoop-mapreduce-client ........................... SUCCESS [0.060s]
[INFO] hadoop-mapreduce-client-core ...................... SUCCESS [9.412s]
[INFO] hadoop-yarn-applications .......................... SUCCESS [0.086s]
[INFO] hadoop-yarn-applications-distributedshell ......... SUCCESS [22.405s]
[INFO] hadoop-yarn-site .................................. SUCCESS [0.142s]
[INFO] hadoop-mapreduce-client-common .................... SUCCESS [18.432s]
[INFO] hadoop-mapreduce-client-shuffle ................... SUCCESS [0.988s]
[INFO] hadoop-mapreduce-client-app ....................... SUCCESS [4:06.826s]
[INFO] hadoop-mapreduce-client-hs ........................ SUCCESS [1:03.457s]
[INFO] hadoop-mapreduce-client-jobclient ................. FAILURE [41:24.330s]
[INFO] Apache Hadoop MapReduce Examples .................. SKIPPED
[INFO] hadoop-mapreduce .................................. SKIPPED
[INFO] ------------------------------------------------------------------------
[INFO] BUILD FAILURE
[INFO] ------------------------------------------------------------------------
[INFO] Total time: 54:09.389s
[INFO] Finished at: Mon Apr 02 14:11:35 UTC 2012
[INFO] Final Memory: 89M/503M
[INFO] ------------------------------------------------------------------------
[ERROR] Failed to execute goal org.apache.maven.plugins:maven-surefire-plugin:2.10:test (default-test)
on project hadoop-mapreduce-client-jobclient: Failure or timeout -> [Help 1]
[ERROR] 
[ERROR] To see the full stack trace of the errors, re-run Maven with the -e switch.
[ERROR] Re-run Maven using the -X switch to enable full debug logging.
[ERROR] 
[ERROR] For more information about the errors and possible solutions, please read the following
articles:
[ERROR] [Help 1] http://cwiki.apache.org/confluence/display/MAVEN/MojoExecutionException
[ERROR] 
[ERROR] After correcting the problems, you can resume the build with the command
[ERROR]   mvn <goals> -rf :hadoop-mapreduce-client-jobclient
Build step 'Execute shell' marked build as failure
[FINDBUGS] Skipping publisher since build result is FAILURE
Archiving artifacts
Updating HDFS-2995
Updating HDFS-3167
Updating HDFS-3174
Updating HADOOP-8236
Updating HADOOP-8199
Updating HADOOP-8238
Updating HDFS-3144
Email was triggered for: Failure
Sending email for trigger: Failure



###################################################################################
############################## FAILED TESTS (if any) ##############################
No tests ran.
Mime
  • Unnamed multipart/mixed (inline, None, 0 bytes)
View raw message