hadoop-mapreduce-dev mailing list archives

Site index · List index
Message view « Date » · « Thread »
Top « Date » · « Thread »
From Apache Jenkins Server <jenk...@builds.apache.org>
Subject Hadoop-Mapreduce-trunk - Build # 1065 - Still Failing
Date Mon, 30 Apr 2012 14:04:13 GMT
See https://builds.apache.org/job/Hadoop-Mapreduce-trunk/1065/

###################################################################################
########################## LAST 60 LINES OF THE CONSOLE ###########################
[...truncated 30052 lines...]
Running org.apache.hadoop.mapreduce.TestMapReduce
Tests run: 1, Failures: 0, Errors: 0, Skipped: 0, Time elapsed: 4.355 sec

Results :

Failed tests:   testClusterWithYarnClientProtocolProvider(org.apache.hadoop.mapreduce.TestYarnClientProtocolProvider):
Cluster should not be initialized with out any framework name

Tests run: 422, Failures: 1, Errors: 0, Skipped: 15

[INFO] ------------------------------------------------------------------------
[INFO] Reactor Summary:
[INFO] 
[INFO] hadoop-yarn ....................................... SUCCESS [2.037s]
[INFO] hadoop-yarn-api ................................... SUCCESS [8.082s]
[INFO] hadoop-yarn-common ................................ SUCCESS [30.122s]
[INFO] hadoop-yarn-server ................................ SUCCESS [0.121s]
[INFO] hadoop-yarn-server-common ......................... SUCCESS [4.036s]
[INFO] hadoop-yarn-server-nodemanager .................... SUCCESS [2:05.424s]
[INFO] hadoop-yarn-server-web-proxy ...................... SUCCESS [1.279s]
[INFO] hadoop-yarn-server-resourcemanager ................ SUCCESS [3:24.428s]
[INFO] hadoop-yarn-server-tests .......................... SUCCESS [40.466s]
[INFO] hadoop-mapreduce-client ........................... SUCCESS [0.066s]
[INFO] hadoop-mapreduce-client-core ...................... SUCCESS [10.409s]
[INFO] hadoop-yarn-applications .......................... SUCCESS [0.090s]
[INFO] hadoop-yarn-applications-distributedshell ......... SUCCESS [22.186s]
[INFO] hadoop-yarn-site .................................. SUCCESS [0.162s]
[INFO] hadoop-mapreduce-client-common .................... SUCCESS [19.150s]
[INFO] hadoop-mapreduce-client-shuffle ................... SUCCESS [0.994s]
[INFO] hadoop-mapreduce-client-app ....................... SUCCESS [4:19.022s]
[INFO] hadoop-mapreduce-client-hs ........................ SUCCESS [1:03.925s]
[INFO] hadoop-mapreduce-client-jobclient ................. FAILURE [34:15.964s]
[INFO] Apache Hadoop MapReduce Examples .................. SKIPPED
[INFO] hadoop-mapreduce .................................. SKIPPED
[INFO] ------------------------------------------------------------------------
[INFO] BUILD FAILURE
[INFO] ------------------------------------------------------------------------
[INFO] Total time: 47:28.985s
[INFO] Finished at: Mon Apr 30 14:03:45 UTC 2012
[INFO] Final Memory: 66M/273M
[INFO] ------------------------------------------------------------------------
[ERROR] Failed to execute goal org.apache.maven.plugins:maven-surefire-plugin:2.12:test (default-test)
on project hadoop-mapreduce-client-jobclient: There are test failures.
[ERROR] 
[ERROR] Please refer to /home/jenkins/jenkins-slave/workspace/Hadoop-Mapreduce-trunk/trunk/hadoop-mapreduce-project/hadoop-mapreduce-client/hadoop-mapreduce-client-jobclient/target/surefire-reports
for the individual test results.
[ERROR] -> [Help 1]
[ERROR] 
[ERROR] To see the full stack trace of the errors, re-run Maven with the -e switch.
[ERROR] Re-run Maven using the -X switch to enable full debug logging.
[ERROR] 
[ERROR] For more information about the errors and possible solutions, please read the following
articles:
[ERROR] [Help 1] http://cwiki.apache.org/confluence/display/MAVEN/MojoFailureException
[ERROR] 
[ERROR] After correcting the problems, you can resume the build with the command
[ERROR]   mvn <goals> -rf :hadoop-mapreduce-client-jobclient
Build step 'Execute shell' marked build as failure
[FINDBUGS] Skipping publisher since build result is FAILURE
Archiving artifacts
Updating HDFS-3265
Email was triggered for: Failure
Sending email for trigger: Failure



###################################################################################
############################## FAILED TESTS (if any) ##############################
No tests ran.
Mime
  • Unnamed multipart/mixed (inline, None, 0 bytes)
View raw message