hadoop-mapreduce-dev mailing list archives

Site index · List index
Message view « Date » · « Thread »
Top « Date » · « Thread »
From Apache Jenkins Server <jenk...@builds.apache.org>
Subject Hadoop-Mapreduce-trunk - Build # 1063 - Still Failing
Date Sat, 28 Apr 2012 14:03:26 GMT
See https://builds.apache.org/job/Hadoop-Mapreduce-trunk/1063/

###################################################################################
########################## LAST 60 LINES OF THE CONSOLE ###########################
[...truncated 28875 lines...]
Tests run: 1, Failures: 0, Errors: 0, Skipped: 0, Time elapsed: 4.363 sec

Results :

Failed tests:   testClusterWithYarnClientProtocolProvider(org.apache.hadoop.mapreduce.TestYarnClientProtocolProvider):
Cluster should not be initialized with out any framework name

Tests run: 421, Failures: 1, Errors: 0, Skipped: 15

[INFO] ------------------------------------------------------------------------
[INFO] Reactor Summary:
[INFO] 
[INFO] hadoop-yarn ....................................... SUCCESS [2.028s]
[INFO] hadoop-yarn-api ................................... SUCCESS [7.954s]
[INFO] hadoop-yarn-common ................................ SUCCESS [29.578s]
[INFO] hadoop-yarn-server ................................ SUCCESS [0.115s]
[INFO] hadoop-yarn-server-common ......................... SUCCESS [4.150s]
[INFO] hadoop-yarn-server-nodemanager .................... SUCCESS [2:05.663s]
[INFO] hadoop-yarn-server-web-proxy ...................... SUCCESS [1.248s]
[INFO] hadoop-yarn-server-resourcemanager ................ SUCCESS [3:25.274s]
[INFO] hadoop-yarn-server-tests .......................... SUCCESS [39.468s]
[INFO] hadoop-mapreduce-client ........................... SUCCESS [0.062s]
[INFO] hadoop-mapreduce-client-core ...................... SUCCESS [10.623s]
[INFO] hadoop-yarn-applications .......................... SUCCESS [0.087s]
[INFO] hadoop-yarn-applications-distributedshell ......... SUCCESS [22.540s]
[INFO] hadoop-yarn-site .................................. SUCCESS [0.160s]
[INFO] hadoop-mapreduce-client-common .................... SUCCESS [18.909s]
[INFO] hadoop-mapreduce-client-shuffle ................... SUCCESS [0.994s]
[INFO] hadoop-mapreduce-client-app ....................... SUCCESS [4:15.500s]
[INFO] hadoop-mapreduce-client-hs ........................ SUCCESS [1:04.372s]
[INFO] hadoop-mapreduce-client-jobclient ................. FAILURE [33:24.422s]
[INFO] Apache Hadoop MapReduce Examples .................. SKIPPED
[INFO] hadoop-mapreduce .................................. SKIPPED
[INFO] ------------------------------------------------------------------------
[INFO] BUILD FAILURE
[INFO] ------------------------------------------------------------------------
[INFO] Total time: 46:34.155s
[INFO] Finished at: Sat Apr 28 14:02:57 UTC 2012
[INFO] Final Memory: 82M/339M
[INFO] ------------------------------------------------------------------------
[ERROR] Failed to execute goal org.apache.maven.plugins:maven-surefire-plugin:2.12:test (default-test)
on project hadoop-mapreduce-client-jobclient: ExecutionException; nested exception is java.util.concurrent.ExecutionException:
org.apache.maven.surefire.booter.SurefireBooterForkException: Error occurred in starting fork,
check output in log -> [Help 1]
[ERROR] 
[ERROR] To see the full stack trace of the errors, re-run Maven with the -e switch.
[ERROR] Re-run Maven using the -X switch to enable full debug logging.
[ERROR] 
[ERROR] For more information about the errors and possible solutions, please read the following
articles:
[ERROR] [Help 1] http://cwiki.apache.org/confluence/display/MAVEN/MojoExecutionException
[ERROR] 
[ERROR] After correcting the problems, you can resume the build with the command
[ERROR]   mvn <goals> -rf :hadoop-mapreduce-client-jobclient
Build step 'Execute shell' marked build as failure
[FINDBUGS] Skipping publisher since build result is FAILURE
Archiving artifacts
Updating HDFS-3309
Updating HDFS-3334
Updating HDFS-3331
Updating HADOOP-8305
Updating HDFS-3326
Email was triggered for: Failure
Sending email for trigger: Failure



###################################################################################
############################## FAILED TESTS (if any) ##############################
No tests ran.
Mime
  • Unnamed multipart/mixed (inline, None, 0 bytes)
View raw message