hadoop-mapreduce-dev mailing list archives

Site index · List index
Message view « Date » · « Thread »
Top « Date » · « Thread »
From Apache Jenkins Server <jenk...@builds.apache.org>
Subject Hadoop-Mapreduce-trunk - Build # 1064 - Still Failing
Date Sun, 29 Apr 2012 14:03:50 GMT
See https://builds.apache.org/job/Hadoop-Mapreduce-trunk/1064/

###################################################################################
########################## LAST 60 LINES OF THE CONSOLE ###########################
[...truncated 30811 lines...]
Running org.apache.hadoop.mapreduce.TestMapReduce
Tests run: 1, Failures: 0, Errors: 0, Skipped: 0, Time elapsed: 4.353 sec

Results :

Failed tests:   testClusterWithYarnClientProtocolProvider(org.apache.hadoop.mapreduce.TestYarnClientProtocolProvider):
Cluster should not be initialized with out any framework name

Tests run: 422, Failures: 1, Errors: 0, Skipped: 15

[INFO] ------------------------------------------------------------------------
[INFO] Reactor Summary:
[INFO] 
[INFO] hadoop-yarn ....................................... SUCCESS [2.028s]
[INFO] hadoop-yarn-api ................................... SUCCESS [7.975s]
[INFO] hadoop-yarn-common ................................ SUCCESS [29.586s]
[INFO] hadoop-yarn-server ................................ SUCCESS [0.114s]
[INFO] hadoop-yarn-server-common ......................... SUCCESS [4.066s]
[INFO] hadoop-yarn-server-nodemanager .................... SUCCESS [2:05.277s]
[INFO] hadoop-yarn-server-web-proxy ...................... SUCCESS [1.257s]
[INFO] hadoop-yarn-server-resourcemanager ................ SUCCESS [3:22.266s]
[INFO] hadoop-yarn-server-tests .......................... SUCCESS [40.486s]
[INFO] hadoop-mapreduce-client ........................... SUCCESS [0.061s]
[INFO] hadoop-mapreduce-client-core ...................... SUCCESS [10.340s]
[INFO] hadoop-yarn-applications .......................... SUCCESS [0.088s]
[INFO] hadoop-yarn-applications-distributedshell ......... SUCCESS [22.160s]
[INFO] hadoop-yarn-site .................................. SUCCESS [0.532s]
[INFO] hadoop-mapreduce-client-common .................... SUCCESS [18.605s]
[INFO] hadoop-mapreduce-client-shuffle ................... SUCCESS [0.990s]
[INFO] hadoop-mapreduce-client-app ....................... SUCCESS [4:14.777s]
[INFO] hadoop-mapreduce-client-hs ........................ SUCCESS [1:06.585s]
[INFO] hadoop-mapreduce-client-jobclient ................. FAILURE [33:37.282s]
[INFO] Apache Hadoop MapReduce Examples .................. SKIPPED
[INFO] hadoop-mapreduce .................................. SKIPPED
[INFO] ------------------------------------------------------------------------
[INFO] BUILD FAILURE
[INFO] ------------------------------------------------------------------------
[INFO] Total time: 46:45.496s
[INFO] Finished at: Sun Apr 29 14:03:20 UTC 2012
[INFO] Final Memory: 66M/293M
[INFO] ------------------------------------------------------------------------
[ERROR] Failed to execute goal org.apache.maven.plugins:maven-surefire-plugin:2.12:test (default-test)
on project hadoop-mapreduce-client-jobclient: There are test failures.
[ERROR] 
[ERROR] Please refer to /home/jenkins/jenkins-slave/workspace/Hadoop-Mapreduce-trunk/trunk/hadoop-mapreduce-project/hadoop-mapreduce-client/hadoop-mapreduce-client-jobclient/target/surefire-reports
for the individual test results.
[ERROR] -> [Help 1]
[ERROR] 
[ERROR] To see the full stack trace of the errors, re-run Maven with the -e switch.
[ERROR] Re-run Maven using the -X switch to enable full debug logging.
[ERROR] 
[ERROR] For more information about the errors and possible solutions, please read the following
articles:
[ERROR] [Help 1] http://cwiki.apache.org/confluence/display/MAVEN/MojoFailureException
[ERROR] 
[ERROR] After correcting the problems, you can resume the build with the command
[ERROR]   mvn <goals> -rf :hadoop-mapreduce-client-jobclient
Build step 'Execute shell' marked build as failure
[FINDBUGS] Skipping publisher since build result is FAILURE
Archiving artifacts
Updating HDFS-2743
Email was triggered for: Failure
Sending email for trigger: Failure



###################################################################################
############################## FAILED TESTS (if any) ##############################
No tests ran.
Mime
  • Unnamed multipart/mixed (inline, None, 0 bytes)
View raw message