hadoop-mapreduce-dev mailing list archives

Site index · List index
Message view « Date » · « Thread »
Top « Date » · « Thread »
From Apache Jenkins Server <jenk...@builds.apache.org>
Subject Hadoop-Mapreduce-trunk - Build # 1061 - Still Failing
Date Thu, 26 Apr 2012 13:23:17 GMT
See https://builds.apache.org/job/Hadoop-Mapreduce-trunk/1061/

###################################################################################
########################## LAST 60 LINES OF THE CONSOLE ###########################
[...truncated 27991 lines...]
[INFO] Reactor Summary:
[INFO] 
[INFO] hadoop-yarn ....................................... SUCCESS [2.071s]
[INFO] hadoop-yarn-api ................................... SUCCESS [7.914s]
[INFO] hadoop-yarn-common ................................ SUCCESS [30.081s]
[INFO] hadoop-yarn-server ................................ SUCCESS [0.120s]
[INFO] hadoop-yarn-server-common ......................... SUCCESS [4.040s]
[INFO] hadoop-yarn-server-nodemanager .................... SUCCESS [2:05.704s]
[INFO] hadoop-yarn-server-web-proxy ...................... SUCCESS [1.271s]
[INFO] hadoop-yarn-server-resourcemanager ................ SUCCESS [3:24.059s]
[INFO] hadoop-yarn-server-tests .......................... FAILURE [25.645s]
[INFO] hadoop-mapreduce-client ........................... SKIPPED
[INFO] hadoop-mapreduce-client-core ...................... SKIPPED
[INFO] hadoop-yarn-applications .......................... SKIPPED
[INFO] hadoop-yarn-applications-distributedshell ......... SKIPPED
[INFO] hadoop-yarn-site .................................. SKIPPED
[INFO] hadoop-mapreduce-client-common .................... SKIPPED
[INFO] hadoop-mapreduce-client-shuffle ................... SKIPPED
[INFO] hadoop-mapreduce-client-app ....................... SKIPPED
[INFO] hadoop-mapreduce-client-hs ........................ SKIPPED
[INFO] hadoop-mapreduce-client-jobclient ................. SKIPPED
[INFO] Apache Hadoop MapReduce Examples .................. SKIPPED
[INFO] hadoop-mapreduce .................................. SKIPPED
[INFO] ------------------------------------------------------------------------
[INFO] BUILD FAILURE
[INFO] ------------------------------------------------------------------------
[INFO] Total time: 6:41.940s
[INFO] Finished at: Thu Apr 26 13:22:46 UTC 2012
[INFO] Final Memory: 53M/424M
[INFO] ------------------------------------------------------------------------
[ERROR] Failed to execute goal org.apache.maven.plugins:maven-surefire-plugin:2.12:test (default-test)
on project hadoop-yarn-server-tests: There are test failures.
[ERROR] 
[ERROR] Please refer to /home/jenkins/jenkins-slave/workspace/Hadoop-Mapreduce-trunk/trunk/hadoop-mapreduce-project/hadoop-yarn/hadoop-yarn-server/hadoop-yarn-server-tests/target/surefire-reports
for the individual test results.
[ERROR] -> [Help 1]
[ERROR] 
[ERROR] To see the full stack trace of the errors, re-run Maven with the -e switch.
[ERROR] Re-run Maven using the -X switch to enable full debug logging.
[ERROR] 
[ERROR] For more information about the errors and possible solutions, please read the following
articles:
[ERROR] [Help 1] http://cwiki.apache.org/confluence/display/MAVEN/MojoFailureException
[ERROR] 
[ERROR] After correcting the problems, you can resume the build with the command
[ERROR]   mvn <goals> -rf :hadoop-yarn-server-tests
Build step 'Execute shell' marked build as failure
[FINDBUGS] Skipping publisher since build result is FAILURE
Archiving artifacts
Updating HDFS-3282
Updating HDFS-3258
Updating HDFS-3321
Updating HADOOP-8144
Updating HADOOP-8296
Updating HDFS-3318
Updating HDFS-3298
Updating MAPREDUCE-3613
Updating MAPREDUCE-4193
Updating MAPREDUCE-4194
Updating HDFS-3319
Email was triggered for: Failure
Sending email for trigger: Failure



###################################################################################
############################## FAILED TESTS (if any) ##############################
No tests ran.
Mime
  • Unnamed multipart/mixed (inline, None, 0 bytes)
View raw message