hadoop-mapreduce-dev mailing list archives

Site index · List index
Message view « Date » · « Thread »
Top « Date » · « Thread »
From Apache Jenkins Server <jenk...@builds.apache.org>
Subject Hadoop-Mapreduce-trunk - Build # 1013 - Still Failing
Date Thu, 08 Mar 2012 13:32:36 GMT
See https://builds.apache.org/job/Hadoop-Mapreduce-trunk/1013/

###################################################################################
########################## LAST 60 LINES OF THE CONSOLE ###########################
[...truncated 27768 lines...]

Tests in error: 
  testNewApis(org.apache.hadoop.mapred.TestLocalModeWithNewApis): chmod: cannot access `/tmp/hadoop-jenkins/mapred/staging/jenkins1145475434/.staging/job_local_0001':
No such file or directory
  testLocalJobRunner(org.apache.hadoop.mapred.TestMRWithDistributedCache): chmod: cannot access
`/tmp/hadoop-jenkins/mapred/staging/jenkins-2141708712/.staging/job_local_0001': No such file
or directory
  testGetRunningJobFromJobClient(org.apache.hadoop.mapred.TestJobClientGetJob): chmod: cannot
access `/tmp/hadoop-jenkins/mapred/staging/jenkins-68802160/.staging/job_local_0001': No such
file or directory

Tests run: 33, Failures: 0, Errors: 3, Skipped: 0

[INFO] ------------------------------------------------------------------------
[INFO] Reactor Summary:
[INFO] 
[INFO] hadoop-yarn ....................................... SUCCESS [1.687s]
[INFO] hadoop-yarn-api ................................... SUCCESS [8.242s]
[INFO] hadoop-yarn-common ................................ SUCCESS [23.927s]
[INFO] hadoop-yarn-server ................................ SUCCESS [0.110s]
[INFO] hadoop-yarn-server-common ......................... SUCCESS [4.166s]
[INFO] hadoop-yarn-server-nodemanager .................... SUCCESS [2:05.587s]
[INFO] hadoop-yarn-server-web-proxy ...................... SUCCESS [1.253s]
[INFO] hadoop-yarn-server-resourcemanager ................ SUCCESS [3:04.001s]
[INFO] hadoop-yarn-server-tests .......................... SUCCESS [40.524s]
[INFO] hadoop-mapreduce-client ........................... SUCCESS [0.060s]
[INFO] hadoop-mapreduce-client-core ...................... SUCCESS [9.563s]
[INFO] hadoop-yarn-applications .......................... SUCCESS [0.081s]
[INFO] hadoop-yarn-applications-distributedshell ......... SUCCESS [22.326s]
[INFO] hadoop-yarn-site .................................. SUCCESS [0.175s]
[INFO] hadoop-mapreduce-client-common .................... FAILURE [10.417s]
[INFO] hadoop-mapreduce-client-shuffle ................... SKIPPED
[INFO] hadoop-mapreduce-client-app ....................... SKIPPED
[INFO] hadoop-mapreduce-client-hs ........................ SKIPPED
[INFO] hadoop-mapreduce-client-jobclient ................. SKIPPED
[INFO] Apache Hadoop MapReduce Examples .................. SKIPPED
[INFO] hadoop-mapreduce .................................. SKIPPED
[INFO] ------------------------------------------------------------------------
[INFO] BUILD FAILURE
[INFO] ------------------------------------------------------------------------
[INFO] Total time: 7:13.176s
[INFO] Finished at: Thu Mar 08 13:26:50 UTC 2012
[INFO] Final Memory: 79M/516M
[INFO] ------------------------------------------------------------------------
[ERROR] Failed to execute goal org.apache.maven.plugins:maven-surefire-plugin:2.10:test (default-test)
on project hadoop-mapreduce-client-common: There are test failures.
[ERROR] 
[ERROR] Please refer to /home/jenkins/jenkins-slave/workspace/Hadoop-Mapreduce-trunk/trunk/hadoop-mapreduce-project/hadoop-mapreduce-client/hadoop-mapreduce-client-common/target/surefire-reports
for the individual test results.
[ERROR] -> [Help 1]
[ERROR] 
[ERROR] To see the full stack trace of the errors, re-run Maven with the -e switch.
[ERROR] Re-run Maven using the -X switch to enable full debug logging.
[ERROR] 
[ERROR] For more information about the errors and possible solutions, please read the following
articles:
[ERROR] [Help 1] http://cwiki.apache.org/confluence/display/MAVEN/MojoFailureException
[ERROR] 
[ERROR] After correcting the problems, you can resume the build with the command
[ERROR]   mvn <goals> -rf :hadoop-mapreduce-client-common
Build step 'Execute shell' marked build as failure
[FINDBUGS] Skipping publisher since build result is FAILURE
Archiving artifacts
Error updating JIRA issues. Saving issues for next build.
com.atlassian.jira.rpc.exception.RemotePermissionException: This issue does not exist or you
don't have permission to view it.
Email was triggered for: Failure
Sending email for trigger: Failure



###################################################################################
############################## FAILED TESTS (if any) ##############################
No tests ran.
Mime
  • Unnamed multipart/mixed (inline, None, 0 bytes)
View raw message