hadoop-mapreduce-dev mailing list archives

Site index · List index
Message view « Date » · « Thread »
Top « Date » · « Thread »
From Apache Jenkins Server <jenk...@builds.apache.org>
Subject Hadoop-Mapreduce-trunk - Build # 1021 - Still Failing
Date Fri, 16 Mar 2012 13:58:59 GMT
See https://builds.apache.org/job/Hadoop-Mapreduce-trunk/1021/

###################################################################################
########################## LAST 60 LINES OF THE CONSOLE ###########################
[...truncated 28287 lines...]

[INFO] ------------------------------------------------------------------------
[INFO] Reactor Summary:
[INFO] 
[INFO] hadoop-yarn ....................................... SUCCESS [1.700s]
[INFO] hadoop-yarn-api ................................... SUCCESS [8.586s]
[INFO] hadoop-yarn-common ................................ SUCCESS [24.426s]
[INFO] hadoop-yarn-server ................................ SUCCESS [0.109s]
[INFO] hadoop-yarn-server-common ......................... SUCCESS [4.117s]
[INFO] hadoop-yarn-server-nodemanager .................... SUCCESS [2:05.037s]
[INFO] hadoop-yarn-server-web-proxy ...................... SUCCESS [1.207s]
[INFO] hadoop-yarn-server-resourcemanager ................ SUCCESS [3:06.283s]
[INFO] hadoop-yarn-server-tests .......................... SUCCESS [40.468s]
[INFO] hadoop-mapreduce-client ........................... SUCCESS [0.061s]
[INFO] hadoop-mapreduce-client-core ...................... SUCCESS [9.098s]
[INFO] hadoop-yarn-applications .......................... SUCCESS [0.086s]
[INFO] hadoop-yarn-applications-distributedshell ......... SUCCESS [22.340s]
[INFO] hadoop-yarn-site .................................. SUCCESS [0.147s]
[INFO] hadoop-mapreduce-client-common .................... SUCCESS [18.239s]
[INFO] hadoop-mapreduce-client-shuffle ................... SUCCESS [1.423s]
[INFO] hadoop-mapreduce-client-app ....................... SUCCESS [4:08.736s]
[INFO] hadoop-mapreduce-client-hs ........................ SUCCESS [1:05.419s]
[INFO] hadoop-mapreduce-client-jobclient ................. FAILURE [28:04.721s]
[INFO] Apache Hadoop MapReduce Examples .................. SKIPPED
[INFO] hadoop-mapreduce .................................. SKIPPED
[INFO] ------------------------------------------------------------------------
[INFO] BUILD FAILURE
[INFO] ------------------------------------------------------------------------
[INFO] Total time: 40:43.247s
[INFO] Finished at: Fri Mar 16 13:58:05 UTC 2012
[INFO] Final Memory: 78M/346M
[INFO] ------------------------------------------------------------------------
[ERROR] Failed to execute goal org.apache.maven.plugins:maven-surefire-plugin:2.10:test (default-test)
on project hadoop-mapreduce-client-jobclient: There are test failures.
[ERROR] 
[ERROR] Please refer to /home/jenkins/jenkins-slave/workspace/Hadoop-Mapreduce-trunk/trunk/hadoop-mapreduce-project/hadoop-mapreduce-client/hadoop-mapreduce-client-jobclient/target/surefire-reports
for the individual test results.
[ERROR] -> [Help 1]
[ERROR] 
[ERROR] To see the full stack trace of the errors, re-run Maven with the -e switch.
[ERROR] Re-run Maven using the -X switch to enable full debug logging.
[ERROR] 
[ERROR] For more information about the errors and possible solutions, please read the following
articles:
[ERROR] [Help 1] http://cwiki.apache.org/confluence/display/MAVEN/MojoFailureException
[ERROR] 
[ERROR] After correcting the problems, you can resume the build with the command
[ERROR]   mvn <goals> -rf :hadoop-mapreduce-client-jobclient
Build step 'Execute shell' marked build as failure
[FINDBUGS] Skipping publisher since build result is FAILURE
Archiving artifacts
Updating HDFS-3098
Updating HDFS-3099
Updating HDFS-3005
Updating HDFS-3062
Updating HDFS-3101
Updating HADOOP-6941
Updating HDFS-3067
Updating HADOOP-8173
Updating HADOOP-8175
Email was triggered for: Failure
Sending email for trigger: Failure



###################################################################################
############################## FAILED TESTS (if any) ##############################
No tests ran.
Mime
  • Unnamed multipart/mixed (inline, None, 0 bytes)
View raw message