hadoop-mapreduce-dev mailing list archives

Site index · List index
Message view « Date » · « Thread »
Top « Date » · « Thread »
From Apache Jenkins Server <jenk...@builds.apache.org>
Subject Hadoop-Mapreduce-trunk - Build # 1012 - Still Failing
Date Wed, 07 Mar 2012 13:25:27 GMT
See https://builds.apache.org/job/Hadoop-Mapreduce-trunk/1012/

###################################################################################
########################## LAST 60 LINES OF THE CONSOLE ###########################
[...truncated 27775 lines...]
[INFO] hadoop-yarn-server ................................ SUCCESS [0.114s]
[INFO] hadoop-yarn-server-common ......................... SUCCESS [4.424s]
[INFO] hadoop-yarn-server-nodemanager .................... SUCCESS [2:05.181s]
[INFO] hadoop-yarn-server-web-proxy ...................... SUCCESS [1.508s]
[INFO] hadoop-yarn-server-resourcemanager ................ SUCCESS [3:05.520s]
[INFO] hadoop-yarn-server-tests .......................... SUCCESS [39.484s]
[INFO] hadoop-mapreduce-client ........................... SUCCESS [0.060s]
[INFO] hadoop-mapreduce-client-core ...................... SUCCESS [9.059s]
[INFO] hadoop-yarn-applications .......................... SUCCESS [0.082s]
[INFO] hadoop-yarn-applications-distributedshell ......... SUCCESS [22.365s]
[INFO] hadoop-yarn-site .................................. SUCCESS [0.147s]
[INFO] hadoop-mapreduce-client-common .................... FAILURE [10.574s]
[INFO] hadoop-mapreduce-client-shuffle ................... SKIPPED
[INFO] hadoop-mapreduce-client-app ....................... SKIPPED
[INFO] hadoop-mapreduce-client-hs ........................ SKIPPED
[INFO] hadoop-mapreduce-client-jobclient ................. SKIPPED
[INFO] Apache Hadoop MapReduce Examples .................. SKIPPED
[INFO] hadoop-mapreduce .................................. SKIPPED
[INFO] ------------------------------------------------------------------------
[INFO] BUILD FAILURE
[INFO] ------------------------------------------------------------------------
[INFO] Total time: 7:13.447s
[INFO] Finished at: Wed Mar 07 13:24:30 UTC 2012
[INFO] Final Memory: 81M/676M
[INFO] ------------------------------------------------------------------------
[ERROR] Failed to execute goal org.apache.maven.plugins:maven-surefire-plugin:2.10:test (default-test)
on project hadoop-mapreduce-client-common: There are test failures.
[ERROR] 
[ERROR] Please refer to /home/jenkins/jenkins-slave/workspace/Hadoop-Mapreduce-trunk/trunk/hadoop-mapreduce-project/hadoop-mapreduce-client/hadoop-mapreduce-client-common/target/surefire-reports
for the individual test results.
[ERROR] -> [Help 1]
[ERROR] 
[ERROR] To see the full stack trace of the errors, re-run Maven with the -e switch.
[ERROR] Re-run Maven using the -X switch to enable full debug logging.
[ERROR] 
[ERROR] For more information about the errors and possible solutions, please read the following
articles:
[ERROR] [Help 1] http://cwiki.apache.org/confluence/display/MAVEN/MojoFailureException
[ERROR] 
[ERROR] After correcting the problems, you can resume the build with the command
[ERROR]   mvn <goals> -rf :hadoop-mapreduce-client-common
Build step 'Execute shell' marked build as failure
[FINDBUGS] Skipping publisher since build result is FAILURE
Archiving artifacts
Updating HDFS-1623
Updating MAPREDUCE-3976
Updating MAPREDUCE-3961
Updating MAPREDUCE-3977
Updating HDFS-2188
Updating HDFS-1765
Updating HDFS-2334
Updating MAPREDUCE-3944
Updating HDFS-2476
Updating HDFS-1580
Updating MAPREDUCE-3975
Updating HADOOP-8140
Updating MAPREDUCE-3974
Updating HDFS-2158
Updating HDFS-2477
Updating HDFS-2495
Email was triggered for: Failure
Sending email for trigger: Failure



###################################################################################
############################## FAILED TESTS (if any) ##############################
No tests ran.
Mime
  • Unnamed multipart/mixed (inline, None, 0 bytes)
View raw message