hadoop-mapreduce-dev mailing list archives

Site index · List index
Message view « Date » · « Thread »
Top « Date » · « Thread »
From Apache Jenkins Server <jenk...@builds.apache.org>
Subject Hadoop-Mapreduce-0.23-Build - Build # 205 - Still Failing
Date Thu, 23 Feb 2012 13:22:06 GMT
See https://builds.apache.org/job/Hadoop-Mapreduce-0.23-Build/205/

###################################################################################
########################## LAST 60 LINES OF THE CONSOLE ###########################
[...truncated 26808 lines...]
Failed tests:   testGetClusterNodes(org.apache.hadoop.yarn.server.resourcemanager.TestClientRMService):
Node is expected to be unhealthy!

Tests run: 162, Failures: 1, Errors: 0, Skipped: 0

[INFO] ------------------------------------------------------------------------
[INFO] Reactor Summary:
[INFO] 
[INFO] hadoop-yarn ....................................... SUCCESS [1.582s]
[INFO] hadoop-yarn-api ................................... SUCCESS [8.907s]
[INFO] hadoop-yarn-common ................................ SUCCESS [25.000s]
[INFO] hadoop-yarn-server ................................ SUCCESS [0.110s]
[INFO] hadoop-yarn-server-common ......................... SUCCESS [4.463s]
[INFO] hadoop-yarn-server-nodemanager .................... SUCCESS [2:05.674s]
[INFO] hadoop-yarn-server-web-proxy ...................... SUCCESS [1.712s]
[INFO] hadoop-yarn-server-resourcemanager ................ FAILURE [3:12.104s]
[INFO] hadoop-yarn-server-tests .......................... SKIPPED
[INFO] hadoop-mapreduce-client ........................... SKIPPED
[INFO] hadoop-mapreduce-client-core ...................... SKIPPED
[INFO] hadoop-yarn-applications .......................... SKIPPED
[INFO] hadoop-yarn-applications-distributedshell ......... SKIPPED
[INFO] hadoop-yarn-site .................................. SKIPPED
[INFO] hadoop-mapreduce-client-common .................... SKIPPED
[INFO] hadoop-mapreduce-client-shuffle ................... SKIPPED
[INFO] hadoop-mapreduce-client-app ....................... SKIPPED
[INFO] hadoop-mapreduce-client-hs ........................ SKIPPED
[INFO] hadoop-mapreduce-client-jobclient ................. SKIPPED
[INFO] Apache Hadoop MapReduce Examples .................. SKIPPED
[INFO] hadoop-mapreduce .................................. SKIPPED
[INFO] ------------------------------------------------------------------------
[INFO] BUILD FAILURE
[INFO] ------------------------------------------------------------------------
[INFO] Total time: 6:00.200s
[INFO] Finished at: Thu Feb 23 13:21:20 UTC 2012
[INFO] Final Memory: 59M/541M
[INFO] ------------------------------------------------------------------------
[ERROR] Failed to execute goal org.apache.maven.plugins:maven-surefire-plugin:2.10:test (default-test)
on project hadoop-yarn-server-resourcemanager: There are test failures.
[ERROR] 
[ERROR] Please refer to /home/jenkins/jenkins-slave/workspace/Hadoop-Mapreduce-0.23-Build/trunk/hadoop-mapreduce-project/hadoop-yarn/hadoop-yarn-server/hadoop-yarn-server-resourcemanager/target/surefire-reports
for the individual test results.
[ERROR] -> [Help 1]
[ERROR] 
[ERROR] To see the full stack trace of the errors, re-run Maven with the -e switch.
[ERROR] Re-run Maven using the -X switch to enable full debug logging.
[ERROR] 
[ERROR] For more information about the errors and possible solutions, please read the following
articles:
[ERROR] [Help 1] http://cwiki.apache.org/confluence/display/MAVEN/MojoFailureException
[ERROR] 
[ERROR] After correcting the problems, you can resume the build with the command
[ERROR]   mvn <goals> -rf :hadoop-yarn-server-resourcemanager
+ [[ 0 -ne 0 ]]
Build step 'Execute shell' marked build as failure
Archiving artifacts
Updating MAPREDUCE-3884
Updating HDFS-2981
Updating HADOOP-7660
Updating HDFS-2944
Updating HDFS-2907
Updating HDFS-2985
Email was triggered for: Failure
Sending email for trigger: Failure



###################################################################################
############################## FAILED TESTS (if any) ##############################
No tests ran.
Mime
  • Unnamed multipart/mixed (inline, None, 0 bytes)
View raw message