hadoop-mapreduce-dev mailing list archives

Site index · List index
Message view « Date » · « Thread »
Top « Date » · « Thread »
From Apache Jenkins Server <jenk...@builds.apache.org>
Subject Hadoop-Mapreduce-0.23-Build - Build # 191 - Still Failing
Date Mon, 13 Feb 2012 07:02:46 GMT
See https://builds.apache.org/job/Hadoop-Mapreduce-0.23-Build/191/

###################################################################################
########################## LAST 60 LINES OF THE CONSOLE ###########################
[...truncated 26114 lines...]
	|                  |            modules            ||   artifacts   |
	|       conf       | number| search|dwnlded|evicted|| number|dwnlded|
	---------------------------------------------------------------------
	|      common      |   85  |   4   |   4   |   8   ||   77  |   4   |
	---------------------------------------------------------------------

ivy-retrieve-common:
[ivy:retrieve] :: retrieving :: org.apache.hadoop#gridmix [sync]
[ivy:retrieve] 	confs: [common]
[ivy:retrieve] 	77 artifacts copied, 0 already retrieved (38800kB/154ms)
[ivy:cachepath] DEPRECATED: 'ivy.conf.file' is deprecated, use 'ivy.settings.file' instead
[ivy:cachepath] :: loading settings :: file = /home/jenkins/jenkins-slave/workspace/Hadoop-Mapreduce-0.23-Build/trunk/hadoop-mapreduce-project/ivy/ivysettings.xml

compile:
     [echo] contrib: gridmix
    [javac] Compiling 44 source files to /home/jenkins/jenkins-slave/workspace/Hadoop-Mapreduce-0.23-Build/trunk/hadoop-mapreduce-project/build/contrib/gridmix/classes
    [javac] Note: Some input files use or override a deprecated API.
    [javac] Note: Recompile with -Xlint:deprecation for details.
    [javac] Note: Some input files use unchecked or unsafe operations.
    [javac] Note: Recompile with -Xlint:unchecked for details.

jar:
     [echo] contrib: gridmix
      [jar] Building jar: /home/jenkins/jenkins-slave/workspace/Hadoop-Mapreduce-0.23-Build/trunk/hadoop-mapreduce-project/build/contrib/gridmix/hadoop-0.23.2-SNAPSHOT-gridmix.jar

BUILD SUCCESSFUL
Total time: 33 seconds
+ RESULT=0
+ [[ 0 -ne 0 ]]
+ gunzip /home/jenkins/jenkins-slave/workspace/Hadoop-Mapreduce-0.23-Build/trunk/hadoop-mapreduce-project/target/hadoop-mapreduce-0.23.2-SNAPSHOT.tar.gz
+ RESULT=0
+ [[ 0 -ne 0 ]]
+ cd /home/jenkins/jenkins-slave/workspace/Hadoop-Mapreduce-0.23-Build/trunk/hadoop-mapreduce-project/build/contrib/
+ tar -rvf /home/jenkins/jenkins-slave/workspace/Hadoop-Mapreduce-0.23-Build/trunk/hadoop-mapreduce-project/target/hadoop-mapreduce-0.23.2-SNAPSHOT.tar
gridmix/hadoop-0.23.2-SNAPSHOT-gridmix.jar
gridmix/hadoop-0.23.2-SNAPSHOT-gridmix.jar
+ RESULT=0
+ gzip /home/jenkins/jenkins-slave/workspace/Hadoop-Mapreduce-0.23-Build/trunk/hadoop-mapreduce-project/target/hadoop-mapreduce-0.23.2-SNAPSHOT.tar
+ RESULT=0
+ /home/jenkins/tools/maven/latest/bin/mvn install
[INFO] Scanning for projects...
[INFO] ------------------------------------------------------------------------
[INFO] BUILD FAILURE
[INFO] ------------------------------------------------------------------------
[INFO] Total time: 0.111s
[INFO] Finished at: Mon Feb 13 07:02:03 UTC 2012
[INFO] Final Memory: 2M/77M
[INFO] ------------------------------------------------------------------------
[ERROR] The goal you specified requires a project to execute but there is no POM in this directory
(/home/jenkins/jenkins-slave/workspace/Hadoop-Mapreduce-0.23-Build/trunk/hadoop-mapreduce-project/build/contrib).
Please verify you invoked Maven from the correct directory. -> [Help 1]
[ERROR] 
[ERROR] To see the full stack trace of the errors, re-run Maven with the -e switch.
[ERROR] Re-run Maven using the -X switch to enable full debug logging.
[ERROR] 
[ERROR] For more information about the errors and possible solutions, please read the following
articles:
[ERROR] [Help 1] http://cwiki.apache.org/confluence/display/MAVEN/MissingProjectException
+ [[ 0 -ne 0 ]]
Build step 'Execute shell' marked build as failure
Archiving artifacts
Email was triggered for: Failure
Sending email for trigger: Failure



###################################################################################
############################## FAILED TESTS (if any) ##############################
No tests ran.
Mime
  • Unnamed multipart/mixed (inline, None, 0 bytes)
View raw message