hadoop-mapreduce-dev mailing list archives

Site index · List index
Message view « Date » · « Thread »
Top « Date » · « Thread »
From Apache Jenkins Server <jenk...@builds.apache.org>
Subject Hadoop-Mapreduce-trunk-Commit - Build # 1665 - Failure
Date Fri, 03 Feb 2012 02:08:38 GMT
See https://builds.apache.org/job/Hadoop-Mapreduce-trunk-Commit/1665/

###################################################################################
########################## LAST 60 LINES OF THE CONSOLE ###########################
[...truncated 14454 lines...]
     [copy] Copying 1 file to /home/jenkins/jenkins-slave/workspace/Hadoop-Mapreduce-trunk-Commit/trunk/hadoop-mapreduce-project/build/test/cache
     [copy] Copying 1 file to /home/jenkins/jenkins-slave/workspace/Hadoop-Mapreduce-trunk-Commit/trunk/hadoop-mapreduce-project/build/test/cache
     [copy] Copying 1 file to /home/jenkins/jenkins-slave/workspace/Hadoop-Mapreduce-trunk-Commit/trunk/hadoop-mapreduce-project/build/test/cache
     [copy] Copying 1 file to /home/jenkins/jenkins-slave/workspace/Hadoop-Mapreduce-trunk-Commit/trunk/hadoop-mapreduce-project/build/test/cache
     [copy] Copying 1 file to /home/jenkins/jenkins-slave/workspace/Hadoop-Mapreduce-trunk-Commit/trunk/hadoop-mapreduce-project/build/test/concat
     [copy] Copying 1 file to /home/jenkins/jenkins-slave/workspace/Hadoop-Mapreduce-trunk-Commit/trunk/hadoop-mapreduce-project/build/test/concat
     [copy] Copying 1 file to /home/jenkins/jenkins-slave/workspace/Hadoop-Mapreduce-trunk-Commit/trunk/hadoop-mapreduce-project/build/test/concat
     [copy] Copying 1 file to /home/jenkins/jenkins-slave/workspace/Hadoop-Mapreduce-trunk-Commit/trunk/hadoop-mapreduce-project/build/test/concat
     [copy] Copying 1 file to /home/jenkins/jenkins-slave/workspace/Hadoop-Mapreduce-trunk-Commit/trunk/hadoop-mapreduce-project/build/test/concat
     [copy] Copying 1 file to /home/jenkins/jenkins-slave/workspace/Hadoop-Mapreduce-trunk-Commit/trunk/hadoop-mapreduce-project/build/test/concat

run-commit-test:
    [mkdir] Created dir: /home/jenkins/jenkins-slave/workspace/Hadoop-Mapreduce-trunk-Commit/trunk/hadoop-mapreduce-project/build/test/data
    [mkdir] Created dir: /home/jenkins/jenkins-slave/workspace/Hadoop-Mapreduce-trunk-Commit/trunk/hadoop-mapreduce-project/build/test/logs
     [copy] Copying 1 file to /home/jenkins/jenkins-slave/workspace/Hadoop-Mapreduce-trunk-Commit/trunk/hadoop-mapreduce-project/build/test/extraconf
     [copy] Copying 1 file to /home/jenkins/jenkins-slave/workspace/Hadoop-Mapreduce-trunk-Commit/trunk/hadoop-mapreduce-project/build/test/extraconf
    [junit] Running org.apache.hadoop.mapred.TestJobHistoryParsing
    [junit] Tests run: 1, Failures: 0, Errors: 0, Time elapsed: 2.719 sec
    [junit] Running org.apache.hadoop.mapred.TestJobInProgress
    [junit] Tests run: 3, Failures: 0, Errors: 0, Time elapsed: 2.296 sec
    [junit] Running org.apache.hadoop.mapred.TestJobQueueTaskScheduler
    [junit] Tests run: 3, Failures: 0, Errors: 0, Time elapsed: 1.196 sec
    [junit] Running org.apache.hadoop.mapred.TestKillCompletedJob
    [junit] Tests run: 1, Failures: 0, Errors: 0, Time elapsed: 1.498 sec
    [junit] Running org.apache.hadoop.mapred.TestLostTracker
    [junit] Tests run: 3, Failures: 0, Errors: 0, Time elapsed: 2.743 sec
    [junit] Running org.apache.hadoop.mapred.TestQueueAclsForCurrentUser
    [junit] Tests run: 3, Failures: 0, Errors: 0, Time elapsed: 0.658 sec
    [junit] Running org.apache.hadoop.mapred.TestRackAwareTaskPlacement
    [junit] Tests run: 1, Failures: 0, Errors: 0, Time elapsed: 1.752 sec
    [junit] Running org.apache.hadoop.mapred.TestSeveral
    [junit] Tests run: 0, Failures: 0, Errors: 0, Time elapsed: 0.035 sec
    [junit] Running org.apache.hadoop.mapred.TestSpeculativeExecution
    [junit] Tests run: 5, Failures: 0, Errors: 0, Time elapsed: 4.574 sec
    [junit] Running org.apache.hadoop.mapred.TestTaskLimits
    [junit] Tests run: 3, Failures: 0, Errors: 0, Time elapsed: 4.993 sec
    [junit] Running org.apache.hadoop.mapred.TestTaskTrackerBlacklisting
    [junit] Tests run: 7, Failures: 0, Errors: 0, Time elapsed: 2.009 sec
    [junit] Running org.apache.hadoop.mapred.TestTrackerBlacklistAcrossJobs
    [junit] Tests run: 1, Failures: 0, Errors: 1, Time elapsed: 117.416 sec
    [junit] Test org.apache.hadoop.mapred.TestTrackerBlacklistAcrossJobs FAILED
    [junit] Running org.apache.hadoop.mapreduce.TestMapReduceLocal
    [junit] Tests run: 1, Failures: 1, Errors: 0, Time elapsed: 103.434 sec
    [junit] Test org.apache.hadoop.mapreduce.TestMapReduceLocal FAILED

checkfailure:
    [touch] Creating /home/jenkins/jenkins-slave/workspace/Hadoop-Mapreduce-trunk-Commit/trunk/hadoop-mapreduce-project/build/test/testsfailed

BUILD FAILED
/home/jenkins/jenkins-slave/workspace/Hadoop-Mapreduce-trunk-Commit/trunk/hadoop-mapreduce-project/build.xml:778:
The following error occurred while executing this line:
/home/jenkins/jenkins-slave/workspace/Hadoop-Mapreduce-trunk-Commit/trunk/hadoop-mapreduce-project/build.xml:741:
The following error occurred while executing this line:
/home/jenkins/jenkins-slave/workspace/Hadoop-Mapreduce-trunk-Commit/trunk/hadoop-mapreduce-project/build.xml:802:
Tests failed!

Total time: 5 minutes 45 seconds
Build step 'Execute shell' marked build as failure
Recording test results
Updating MAPREDUCE-3784
Email was triggered for: Failure
Sending email for trigger: Failure



###################################################################################
############################## FAILED TESTS (if any) ##############################
All tests passed

Mime
View raw message