hadoop-mapreduce-dev mailing list archives

Site index · List index
Message view « Date » · « Thread »
Top « Date » · « Thread »
From Apache Jenkins Server <jenk...@builds.apache.org>
Subject Hadoop-Mapreduce-0.23-Build - Build # 184 - Still Failing
Date Tue, 07 Feb 2012 13:19:16 GMT
See https://builds.apache.org/job/Hadoop-Mapreduce-0.23-Build/184/

###################################################################################
########################## LAST 60 LINES OF THE CONSOLE ###########################
[...truncated 26561 lines...]
[INFO] hadoop-yarn-server-nodemanager .................... FAILURE [2:18.210s]
[INFO] hadoop-yarn-server-web-proxy ...................... SKIPPED
[INFO] hadoop-yarn-server-resourcemanager ................ SKIPPED
[INFO] hadoop-yarn-server-tests .......................... SKIPPED
[INFO] hadoop-mapreduce-client ........................... SKIPPED
[INFO] hadoop-mapreduce-client-core ...................... SKIPPED
[INFO] hadoop-yarn-applications .......................... SKIPPED
[INFO] hadoop-yarn-applications-distributedshell ......... SKIPPED
[INFO] hadoop-yarn-site .................................. SKIPPED
[INFO] hadoop-mapreduce-client-common .................... SKIPPED
[INFO] hadoop-mapreduce-client-shuffle ................... SKIPPED
[INFO] hadoop-mapreduce-client-app ....................... SKIPPED
[INFO] hadoop-mapreduce-client-hs ........................ SKIPPED
[INFO] hadoop-mapreduce-client-jobclient ................. SKIPPED
[INFO] Apache Hadoop MapReduce Examples .................. SKIPPED
[INFO] hadoop-mapreduce .................................. SKIPPED
[INFO] ------------------------------------------------------------------------
[INFO] BUILD FAILURE
[INFO] ------------------------------------------------------------------------
[INFO] Total time: 2:58.844s
[INFO] Finished at: Tue Feb 07 13:17:25 UTC 2012
[INFO] Final Memory: 53M/453M
[INFO] ------------------------------------------------------------------------
[ERROR] Failed to execute goal org.apache.maven.plugins:maven-surefire-plugin:2.10:test (default-test)
on project hadoop-yarn-server-nodemanager: There are test failures.
[ERROR] 
[ERROR] Please refer to /home/jenkins/jenkins-slave/workspace/Hadoop-Mapreduce-0.23-Build/trunk/hadoop-mapreduce-project/hadoop-yarn/hadoop-yarn-server/hadoop-yarn-server-nodemanager/target/surefire-reports
for the individual test results.
[ERROR] -> [Help 1]
[ERROR] 
[ERROR] To see the full stack trace of the errors, re-run Maven with the -e switch.
[ERROR] Re-run Maven using the -X switch to enable full debug logging.
[ERROR] 
[ERROR] For more information about the errors and possible solutions, please read the following
articles:
[ERROR] [Help 1] http://cwiki.apache.org/confluence/display/MAVEN/MojoFailureException
[ERROR] 
[ERROR] After correcting the problems, you can resume the build with the command
[ERROR]   mvn <goals> -rf :hadoop-yarn-server-nodemanager
+ [[ 2 -ne 0 ]]
+ echo 'Build failed'
Build failed
+ exit 1
Build step 'Execute shell' marked build as failure
Archiving artifacts
Updating HDFS-2886
Updating MAPREDUCE-3709
Updating MAPREDUCE-3794
Updating MAPREDUCE-3810
Updating MAPREDUCE-3697
Updating MAPREDUCE-3814
Updating MAPREDUCE-3813
Updating MAPREDUCE-901
Updating MAPREDUCE-3808
Updating MAPREDUCE-3817
Updating MAPREDUCE-3809
Updating MAPREDUCE-3354
Updating MAPREDUCE-3804
Updating HADOOP-8027
Updating HADOOP-7761
Email was triggered for: Failure
Sending email for trigger: Failure



###################################################################################
############################## FAILED TESTS (if any) ##############################
No tests ran.

Mime
View raw message