hadoop-mapreduce-dev mailing list archives

Site index · List index
Message view « Date » · « Thread »
Top « Date » · « Thread »
From Apache Jenkins Server <jenk...@builds.apache.org>
Subject Hadoop-Mapreduce-trunk - Build # 981 - Failure
Date Mon, 06 Feb 2012 14:10:32 GMT
See https://builds.apache.org/job/Hadoop-Mapreduce-trunk/981/

###################################################################################
########################## LAST 60 LINES OF THE CONSOLE ###########################
[...truncated 27902 lines...]
  testNewCounterA(org.apache.hadoop.mapred.TestJobCounters)
  testNewCounterB(org.apache.hadoop.mapred.TestJobCounters)
  testNewCounterC(org.apache.hadoop.mapred.TestJobCounters)
  testNewCounterD(org.apache.hadoop.mapred.TestJobCounters)

Tests run: 398, Failures: 8, Errors: 0, Skipped: 22

[INFO] ------------------------------------------------------------------------
[INFO] Reactor Summary:
[INFO] 
[INFO] hadoop-yarn ....................................... SUCCESS [1.565s]
[INFO] hadoop-yarn-api ................................... SUCCESS [8.336s]
[INFO] hadoop-yarn-common ................................ SUCCESS [22.844s]
[INFO] hadoop-yarn-server ................................ SUCCESS [0.107s]
[INFO] hadoop-yarn-server-common ......................... SUCCESS [4.055s]
[INFO] hadoop-yarn-server-nodemanager .................... SUCCESS [2:01.506s]
[INFO] hadoop-yarn-server-web-proxy ...................... SUCCESS [1.239s]
[INFO] hadoop-yarn-server-resourcemanager ................ SUCCESS [3:02.140s]
[INFO] hadoop-yarn-server-tests .......................... SUCCESS [39.684s]
[INFO] hadoop-mapreduce-client ........................... SUCCESS [0.058s]
[INFO] hadoop-mapreduce-client-core ...................... SUCCESS [8.377s]
[INFO] hadoop-yarn-applications .......................... SUCCESS [0.076s]
[INFO] hadoop-yarn-applications-distributedshell ......... SUCCESS [23.353s]
[INFO] hadoop-yarn-site .................................. SUCCESS [0.143s]
[INFO] hadoop-mapreduce-client-common .................... SUCCESS [29.087s]
[INFO] hadoop-mapreduce-client-shuffle ................... SUCCESS [0.978s]
[INFO] hadoop-mapreduce-client-app ....................... SUCCESS [3:52.025s]
[INFO] hadoop-mapreduce-client-hs ........................ SUCCESS [1:01.873s]
[INFO] hadoop-mapreduce-client-jobclient ................. FAILURE [42:42.276s]
[INFO] Apache Hadoop MapReduce Examples .................. SKIPPED
[INFO] hadoop-mapreduce .................................. SKIPPED
[INFO] ------------------------------------------------------------------------
[INFO] BUILD FAILURE
[INFO] ------------------------------------------------------------------------
[INFO] Total time: 55:00.321s
[INFO] Finished at: Mon Feb 06 14:08:50 UTC 2012
[INFO] Final Memory: 78M/399M
[INFO] ------------------------------------------------------------------------
[ERROR] Failed to execute goal org.apache.maven.plugins:maven-surefire-plugin:2.10:test (default-test)
on project hadoop-mapreduce-client-jobclient: There are test failures.
[ERROR] 
[ERROR] Please refer to /home/jenkins/jenkins-slave/workspace/Hadoop-Mapreduce-trunk/trunk/hadoop-mapreduce-project/hadoop-mapreduce-client/hadoop-mapreduce-client-jobclient/target/surefire-reports
for the individual test results.
[ERROR] -> [Help 1]
[ERROR] 
[ERROR] To see the full stack trace of the errors, re-run Maven with the -e switch.
[ERROR] Re-run Maven using the -X switch to enable full debug logging.
[ERROR] 
[ERROR] For more information about the errors and possible solutions, please read the following
articles:
[ERROR] [Help 1] http://cwiki.apache.org/confluence/display/MAVEN/MojoFailureException
[ERROR] 
[ERROR] After correcting the problems, you can resume the build with the command
[ERROR]   mvn <goals> -rf :hadoop-mapreduce-client-jobclient
Build step 'Execute shell' marked build as failure
[FINDBUGS] Skipping publisher since build result is FAILURE
Archiving artifacts
Updating MAPREDUCE-3747
Updating HDFS-2868
Updating HDFS-2893
Email was triggered for: Failure
Sending email for trigger: Failure



###################################################################################
############################## FAILED TESTS (if any) ##############################
No tests ran.

Mime
View raw message