hadoop-mapreduce-dev mailing list archives

Site index · List index
Message view « Date » · « Thread »
Top « Date » · « Thread »
From Apache Jenkins Server <jenk...@builds.apache.org>
Subject Hadoop-Mapreduce-0.23-Build - Build # 198 - Still Failing
Date Thu, 16 Feb 2012 13:18:11 GMT
See https://builds.apache.org/job/Hadoop-Mapreduce-0.23-Build/198/

###################################################################################
########################## LAST 60 LINES OF THE CONSOLE ###########################
[...truncated 26579 lines...]
Failed tests:   testContainerKillOnMemoryOverflow(org.apache.hadoop.yarn.server.nodemanager.containermanager.monitor.TestContainersMonitor):
expected:<143> but was:<0>

Tests run: 124, Failures: 1, Errors: 0, Skipped: 0

[INFO] ------------------------------------------------------------------------
[INFO] Reactor Summary:
[INFO] 
[INFO] hadoop-yarn ....................................... SUCCESS [1.622s]
[INFO] hadoop-yarn-api ................................... SUCCESS [9.063s]
[INFO] hadoop-yarn-common ................................ SUCCESS [24.971s]
[INFO] hadoop-yarn-server ................................ SUCCESS [0.122s]
[INFO] hadoop-yarn-server-common ......................... SUCCESS [4.362s]
[INFO] hadoop-yarn-server-nodemanager .................... FAILURE [2:17.915s]
[INFO] hadoop-yarn-server-web-proxy ...................... SKIPPED
[INFO] hadoop-yarn-server-resourcemanager ................ SKIPPED
[INFO] hadoop-yarn-server-tests .......................... SKIPPED
[INFO] hadoop-mapreduce-client ........................... SKIPPED
[INFO] hadoop-mapreduce-client-core ...................... SKIPPED
[INFO] hadoop-yarn-applications .......................... SKIPPED
[INFO] hadoop-yarn-applications-distributedshell ......... SKIPPED
[INFO] hadoop-yarn-site .................................. SKIPPED
[INFO] hadoop-mapreduce-client-common .................... SKIPPED
[INFO] hadoop-mapreduce-client-shuffle ................... SKIPPED
[INFO] hadoop-mapreduce-client-app ....................... SKIPPED
[INFO] hadoop-mapreduce-client-hs ........................ SKIPPED
[INFO] hadoop-mapreduce-client-jobclient ................. SKIPPED
[INFO] Apache Hadoop MapReduce Examples .................. SKIPPED
[INFO] hadoop-mapreduce .................................. SKIPPED
[INFO] ------------------------------------------------------------------------
[INFO] BUILD FAILURE
[INFO] ------------------------------------------------------------------------
[INFO] Total time: 2:58.662s
[INFO] Finished at: Thu Feb 16 13:17:21 UTC 2012
[INFO] Final Memory: 52M/467M
[INFO] ------------------------------------------------------------------------
[ERROR] Failed to execute goal org.apache.maven.plugins:maven-surefire-plugin:2.10:test (default-test)
on project hadoop-yarn-server-nodemanager: There are test failures.
[ERROR] 
[ERROR] Please refer to /home/jenkins/jenkins-slave/workspace/Hadoop-Mapreduce-0.23-Build/trunk/hadoop-mapreduce-project/hadoop-yarn/hadoop-yarn-server/hadoop-yarn-server-nodemanager/target/surefire-reports
for the individual test results.
[ERROR] -> [Help 1]
[ERROR] 
[ERROR] To see the full stack trace of the errors, re-run Maven with the -e switch.
[ERROR] Re-run Maven using the -X switch to enable full debug logging.
[ERROR] 
[ERROR] For more information about the errors and possible solutions, please read the following
articles:
[ERROR] [Help 1] http://cwiki.apache.org/confluence/display/MAVEN/MojoFailureException
[ERROR] 
[ERROR] After correcting the problems, you can resume the build with the command
[ERROR]   mvn <goals> -rf :hadoop-yarn-server-nodemanager
+ [[ 0 -ne 0 ]]
Build step 'Execute shell' marked build as failure
Archiving artifacts
Updating HADOOP-8074
Updating HDFS-2950
Updating MAPREDUCE-3864
Updating HADOOP-6502
Updating HDFS-2525
Updating HDFS-2938
Email was triggered for: Failure
Sending email for trigger: Failure



###################################################################################
############################## FAILED TESTS (if any) ##############################
No tests ran.
Mime
  • Unnamed multipart/mixed (inline, None, 0 bytes)
View raw message