hadoop-mapreduce-dev mailing list archives

Site index · List index
Message view « Date » · « Thread »
Top « Date » · « Thread »
From Apache Jenkins Server <jenk...@builds.apache.org>
Subject Hadoop-Mapreduce-0.23-Build - Build # 206 - Still Failing
Date Fri, 24 Feb 2012 13:57:45 GMT
See https://builds.apache.org/job/Hadoop-Mapreduce-0.23-Build/206/

###################################################################################
########################## LAST 60 LINES OF THE CONSOLE ###########################
[...truncated 27710 lines...]
Tests run: 1, Failures: 0, Errors: 0, Skipped: 0, Time elapsed: 0.276 sec

Results :

Failed tests:   testRemoveMap(org.apache.hadoop.mapred.TestIndexCache): expected:<true>
but was:<false>

Tests run: 403, Failures: 1, Errors: 0, Skipped: 22

[INFO] ------------------------------------------------------------------------
[INFO] Reactor Summary:
[INFO] 
[INFO] hadoop-yarn ....................................... SUCCESS [1.577s]
[INFO] hadoop-yarn-api ................................... SUCCESS [8.530s]
[INFO] hadoop-yarn-common ................................ SUCCESS [25.056s]
[INFO] hadoop-yarn-server ................................ SUCCESS [0.120s]
[INFO] hadoop-yarn-server-common ......................... SUCCESS [4.528s]
[INFO] hadoop-yarn-server-nodemanager .................... SUCCESS [2:07.992s]
[INFO] hadoop-yarn-server-web-proxy ...................... SUCCESS [1.575s]
[INFO] hadoop-yarn-server-resourcemanager ................ SUCCESS [3:14.201s]
[INFO] hadoop-yarn-server-tests .......................... SUCCESS [40.044s]
[INFO] hadoop-mapreduce-client ........................... SUCCESS [0.068s]
[INFO] hadoop-mapreduce-client-core ...................... SUCCESS [9.806s]
[INFO] hadoop-yarn-applications .......................... SUCCESS [0.084s]
[INFO] hadoop-yarn-applications-distributedshell ......... SUCCESS [22.626s]
[INFO] hadoop-yarn-site .................................. SUCCESS [0.143s]
[INFO] hadoop-mapreduce-client-common .................... SUCCESS [19.089s]
[INFO] hadoop-mapreduce-client-shuffle ................... SUCCESS [1.367s]
[INFO] hadoop-mapreduce-client-app ....................... SUCCESS [4:10.293s]
[INFO] hadoop-mapreduce-client-hs ........................ SUCCESS [1:04.198s]
[INFO] hadoop-mapreduce-client-jobclient ................. FAILURE [28:07.758s]
[INFO] Apache Hadoop MapReduce Examples .................. SKIPPED
[INFO] hadoop-mapreduce .................................. SKIPPED
[INFO] ------------------------------------------------------------------------
[INFO] BUILD FAILURE
[INFO] ------------------------------------------------------------------------
[INFO] Total time: 40:59.722s
[INFO] Finished at: Fri Feb 24 13:56:58 UTC 2012
[INFO] Final Memory: 77M/541M
[INFO] ------------------------------------------------------------------------
[ERROR] Failed to execute goal org.apache.maven.plugins:maven-surefire-plugin:2.10:test (default-test)
on project hadoop-mapreduce-client-jobclient: There are test failures.
[ERROR] 
[ERROR] Please refer to /home/jenkins/jenkins-slave/workspace/Hadoop-Mapreduce-0.23-Build/trunk/hadoop-mapreduce-project/hadoop-mapreduce-client/hadoop-mapreduce-client-jobclient/target/surefire-reports
for the individual test results.
[ERROR] -> [Help 1]
[ERROR] 
[ERROR] To see the full stack trace of the errors, re-run Maven with the -e switch.
[ERROR] Re-run Maven using the -X switch to enable full debug logging.
[ERROR] 
[ERROR] For more information about the errors and possible solutions, please read the following
articles:
[ERROR] [Help 1] http://cwiki.apache.org/confluence/display/MAVEN/MojoFailureException
[ERROR] 
[ERROR] After correcting the problems, you can resume the build with the command
[ERROR]   mvn <goals> -rf :hadoop-mapreduce-client-jobclient
+ [[ 0 -ne 0 ]]
Build step 'Execute shell' marked build as failure
Archiving artifacts
Updating MAPREDUCE-3738
Updating MAPREDUCE-3878
Email was triggered for: Failure
Sending email for trigger: Failure



###################################################################################
############################## FAILED TESTS (if any) ##############################
No tests ran.
Mime
  • Unnamed multipart/mixed (inline, None, 0 bytes)
View raw message