hadoop-mapreduce-dev mailing list archives

Site index · List index
Message view « Date » · « Thread »
Top « Date » · « Thread »
From Apache Jenkins Server <jenk...@builds.apache.org>
Subject Hadoop-Mapreduce-trunk - Build # 982 - Still Failing
Date Tue, 07 Feb 2012 13:53:07 GMT
See https://builds.apache.org/job/Hadoop-Mapreduce-trunk/982/

###################################################################################
########################## LAST 60 LINES OF THE CONSOLE ###########################
[...truncated 27870 lines...]
[INFO] hadoop-yarn-server-nodemanager .................... SUCCESS [2:02.265s]
[INFO] hadoop-yarn-server-web-proxy ...................... SUCCESS [1.218s]
[INFO] hadoop-yarn-server-resourcemanager ................ SUCCESS [3:02.019s]
[INFO] hadoop-yarn-server-tests .......................... SUCCESS [40.502s]
[INFO] hadoop-mapreduce-client ........................... SUCCESS [0.059s]
[INFO] hadoop-mapreduce-client-core ...................... SUCCESS [8.160s]
[INFO] hadoop-yarn-applications .......................... SUCCESS [0.083s]
[INFO] hadoop-yarn-applications-distributedshell ......... SUCCESS [22.388s]
[INFO] hadoop-yarn-site .................................. SUCCESS [0.141s]
[INFO] hadoop-mapreduce-client-common .................... SUCCESS [18.206s]
[INFO] hadoop-mapreduce-client-shuffle ................... SUCCESS [0.970s]
[INFO] hadoop-mapreduce-client-app ....................... SUCCESS [3:50.390s]
[INFO] hadoop-mapreduce-client-hs ........................ SUCCESS [1:02.287s]
[INFO] hadoop-mapreduce-client-jobclient ................. FAILURE [25:08.378s]
[INFO] Apache Hadoop MapReduce Examples .................. SKIPPED
[INFO] hadoop-mapreduce .................................. SKIPPED
[INFO] ------------------------------------------------------------------------
[INFO] BUILD FAILURE
[INFO] ------------------------------------------------------------------------
[INFO] Total time: 37:15.144s
[INFO] Finished at: Tue Feb 07 13:51:21 UTC 2012
[INFO] Final Memory: 79M/406M
[INFO] ------------------------------------------------------------------------
[ERROR] Failed to execute goal org.apache.maven.plugins:maven-surefire-plugin:2.10:test (default-test)
on project hadoop-mapreduce-client-jobclient: There are test failures.
[ERROR] 
[ERROR] Please refer to /home/jenkins/jenkins-slave/workspace/Hadoop-Mapreduce-trunk/trunk/hadoop-mapreduce-project/hadoop-mapreduce-client/hadoop-mapreduce-client-jobclient/target/surefire-reports
for the individual test results.
[ERROR] -> [Help 1]
[ERROR] 
[ERROR] To see the full stack trace of the errors, re-run Maven with the -e switch.
[ERROR] Re-run Maven using the -X switch to enable full debug logging.
[ERROR] 
[ERROR] For more information about the errors and possible solutions, please read the following
articles:
[ERROR] [Help 1] http://cwiki.apache.org/confluence/display/MAVEN/MojoFailureException
[ERROR] 
[ERROR] After correcting the problems, you can resume the build with the command
[ERROR]   mvn <goals> -rf :hadoop-mapreduce-client-jobclient
Build step 'Execute shell' marked build as failure
[FINDBUGS] Skipping publisher since build result is FAILURE
Archiving artifacts
Updating HDFS-2886
Updating MAPREDUCE-3709
Updating MAPREDUCE-3794
Updating HDFS-2895
Updating MAPREDUCE-3810
Updating MAPREDUCE-3697
Updating MAPREDUCE-3811
Updating MAPREDUCE-3814
Updating MAPREDUCE-3813
Updating MAPREDUCE-901
Updating MAPREDUCE-3808
Updating MAPREDUCE-3818
Updating MAPREDUCE-3817
Updating MAPREDUCE-3809
Updating MAPREDUCE-3354
Updating MAPREDUCE-3804
Updating HADOOP-8027
Updating HADOOP-8017
Email was triggered for: Failure
Sending email for trigger: Failure



###################################################################################
############################## FAILED TESTS (if any) ##############################
No tests ran.

Mime
View raw message