hadoop-mapreduce-dev mailing list archives

Site index · List index
Message view « Date » · « Thread »
Top « Date » · « Thread »
From Apache Jenkins Server <jenk...@builds.apache.org>
Subject Hadoop-Mapreduce-0.23-Build - Build # 174 - Still Failing
Date Sat, 28 Jan 2012 13:29:53 GMT
See https://builds.apache.org/job/Hadoop-Mapreduce-0.23-Build/174/

###################################################################################
########################## LAST 60 LINES OF THE CONSOLE ###########################
[...truncated 26866 lines...]
[INFO] 
[INFO] hadoop-yarn ....................................... SUCCESS [1.927s]
[INFO] hadoop-yarn-api ................................... SUCCESS [8.548s]
[INFO] hadoop-yarn-common ................................ SUCCESS [22.186s]
[INFO] hadoop-yarn-server ................................ SUCCESS [0.107s]
[INFO] hadoop-yarn-server-common ......................... SUCCESS [4.046s]
[INFO] hadoop-yarn-server-nodemanager .................... SUCCESS [2:01.692s]
[INFO] hadoop-yarn-server-web-proxy ...................... SUCCESS [1.537s]
[INFO] hadoop-yarn-server-resourcemanager ................ SUCCESS [2:53.337s]
[INFO] hadoop-yarn-server-tests .......................... SUCCESS [40.516s]
[INFO] hadoop-mapreduce-client ........................... SUCCESS [0.061s]
[INFO] hadoop-mapreduce-client-core ...................... SUCCESS [7.182s]
[INFO] hadoop-yarn-applications .......................... SUCCESS [0.139s]
[INFO] hadoop-yarn-applications-distributedshell ......... SUCCESS [23.509s]
[INFO] hadoop-yarn-site .................................. SUCCESS [0.148s]
[INFO] hadoop-mapreduce-client-common .................... FAILURE [10.671s]
[INFO] hadoop-mapreduce-client-shuffle ................... SKIPPED
[INFO] hadoop-mapreduce-client-app ....................... SKIPPED
[INFO] hadoop-mapreduce-client-hs ........................ SKIPPED
[INFO] hadoop-mapreduce-client-jobclient ................. SKIPPED
[INFO] Apache Hadoop MapReduce Examples .................. SKIPPED
[INFO] hadoop-mapreduce .................................. SKIPPED
[INFO] ------------------------------------------------------------------------
[INFO] BUILD FAILURE
[INFO] ------------------------------------------------------------------------
[INFO] Total time: 6:56.270s
[INFO] Finished at: Sat Jan 28 13:22:35 UTC 2012
[INFO] Final Memory: 73M/469M
[INFO] ------------------------------------------------------------------------
[ERROR] Failed to execute goal org.apache.maven.plugins:maven-surefire-plugin:2.10:test (default-test)
on project hadoop-mapreduce-client-common: There are test failures.
[ERROR] 
[ERROR] Please refer to /home/jenkins/jenkins-slave/workspace/Hadoop-Mapreduce-0.23-Build/trunk/hadoop-mapreduce-project/hadoop-mapreduce-client/hadoop-mapreduce-client-common/target/surefire-reports
for the individual test results.
[ERROR] -> [Help 1]
[ERROR] 
[ERROR] To see the full stack trace of the errors, re-run Maven with the -e switch.
[ERROR] Re-run Maven using the -X switch to enable full debug logging.
[ERROR] 
[ERROR] For more information about the errors and possible solutions, please read the following
articles:
[ERROR] [Help 1] http://cwiki.apache.org/confluence/display/MAVEN/MojoFailureException
[ERROR] 
[ERROR] After correcting the problems, you can resume the build with the command
[ERROR]   mvn <goals> -rf :hadoop-mapreduce-client-common
+ [[ 2 -ne 0 ]]
+ echo 'Build failed'
Build failed
+ exit 1
Build step 'Execute shell' marked build as failure
Archiving artifacts
Updating HADOOP-7998
Updating HADOOP-7988
Updating HADOOP-7939
Updating HDFS-2840
Updating MAPREDUCE-3742
Updating HDFS-2791
Updating HADOOP-8000
Updating MAPREDUCE-3732
Updating HADOOP-8002
Email was triggered for: Failure
Sending email for trigger: Failure



###################################################################################
############################## FAILED TESTS (if any) ##############################
No tests ran.

Mime
View raw message