hadoop-mapreduce-dev mailing list archives

Site index · List index
Message view « Date » · « Thread »
Top « Date » · « Thread »
From Apache Jenkins Server <jenk...@builds.apache.org>
Subject Hadoop-Mapreduce-trunk - Build # 959 - Still Failing
Date Sun, 15 Jan 2012 13:22:28 GMT
See https://builds.apache.org/job/Hadoop-Mapreduce-trunk/959/

###################################################################################
########################## LAST 60 LINES OF THE CONSOLE ###########################
[...truncated 25864 lines...]
  testLocalJobRunner(org.apache.hadoop.mapred.TestMRWithDistributedCache): chmod: cannot access
`/tmp/hadoop-jenkins/mapred/staging/jenkins1080960094/.staging/job_local_0001': No such file
or directory
  testGetRunningJobFromJobClient(org.apache.hadoop.mapred.TestJobClientGetJob): chmod: cannot
access `/tmp/hadoop-jenkins/mapred/staging/jenkins386517660/.staging/job_local_0001': No such
file or directory

Tests run: 30, Failures: 0, Errors: 3, Skipped: 0

[INFO] ------------------------------------------------------------------------
[INFO] Reactor Summary:
[INFO] 
[INFO] hadoop-yarn ....................................... SUCCESS [1.447s]
[INFO] hadoop-yarn-api ................................... SUCCESS [8.405s]
[INFO] hadoop-yarn-common ................................ SUCCESS [22.912s]
[INFO] hadoop-yarn-server ................................ SUCCESS [0.107s]
[INFO] hadoop-yarn-server-common ......................... SUCCESS [4.213s]
[INFO] hadoop-yarn-server-nodemanager .................... SUCCESS [2:02.031s]
[INFO] hadoop-yarn-server-web-proxy ...................... SUCCESS [0.683s]
[INFO] hadoop-yarn-server-resourcemanager ................ SUCCESS [2:50.788s]
[INFO] hadoop-yarn-server-tests .......................... SUCCESS [40.547s]
[INFO] hadoop-mapreduce-client ........................... SUCCESS [0.057s]
[INFO] hadoop-mapreduce-client-core ...................... SUCCESS [7.503s]
[INFO] hadoop-yarn-applications .......................... SUCCESS [0.079s]
[INFO] hadoop-yarn-applications-distributedshell ......... SUCCESS [23.337s]
[INFO] hadoop-yarn-site .................................. SUCCESS [0.140s]
[INFO] hadoop-mapreduce-client-common .................... FAILURE [10.075s]
[INFO] hadoop-mapreduce-client-shuffle ................... SKIPPED
[INFO] hadoop-mapreduce-client-app ....................... SKIPPED
[INFO] hadoop-mapreduce-client-hs ........................ SKIPPED
[INFO] hadoop-mapreduce-client-jobclient ................. SKIPPED
[INFO] Apache Hadoop MapReduce Examples .................. SKIPPED
[INFO] hadoop-mapreduce .................................. SKIPPED
[INFO] ------------------------------------------------------------------------
[INFO] BUILD FAILURE
[INFO] ------------------------------------------------------------------------
[INFO] Total time: 6:52.910s
[INFO] Finished at: Sun Jan 15 13:20:43 UTC 2012
[INFO] Final Memory: 72M/571M
[INFO] ------------------------------------------------------------------------
[ERROR] Failed to execute goal org.apache.maven.plugins:maven-surefire-plugin:2.10:test (default-test)
on project hadoop-mapreduce-client-common: There are test failures.
[ERROR] 
[ERROR] Please refer to /home/jenkins/jenkins-slave/workspace/Hadoop-Mapreduce-trunk/trunk/hadoop-mapreduce-project/hadoop-mapreduce-client/hadoop-mapreduce-client-common/target/surefire-reports
for the individual test results.
[ERROR] -> [Help 1]
[ERROR] 
[ERROR] To see the full stack trace of the errors, re-run Maven with the -e switch.
[ERROR] Re-run Maven using the -X switch to enable full debug logging.
[ERROR] 
[ERROR] For more information about the errors and possible solutions, please read the following
articles:
[ERROR] [Help 1] http://cwiki.apache.org/confluence/display/MAVEN/MojoFailureException
[ERROR] 
[ERROR] After correcting the problems, you can resume the build with the command
[ERROR]   mvn <goals> -rf :hadoop-mapreduce-client-common
Build step 'Execute shell' marked build as failure
[FINDBUGS] Skipping publisher since build result is FAILURE
Archiving artifacts
Updating HDFS-2788
Updating HADOOP-7974
Updating HADOOP-7975
Updating HDFS-2790
Updating HADOOP-7657
Email was triggered for: Failure
Sending email for trigger: Failure



###################################################################################
############################## FAILED TESTS (if any) ##############################
No tests ran.

Mime
View raw message