hadoop-mapreduce-dev mailing list archives

Site index · List index
Message view « Date » · « Thread »
Top « Date » · « Thread »
From Apache Jenkins Server <jenk...@builds.apache.org>
Subject Hadoop-Mapreduce-trunk - Build # 954 - Failure
Date Tue, 10 Jan 2012 13:22:18 GMT
See https://builds.apache.org/job/Hadoop-Mapreduce-trunk/954/

###################################################################################
########################## LAST 60 LINES OF THE CONSOLE ###########################
[...truncated 25712 lines...]
  testGetRunningJobFromJobClient(org.apache.hadoop.mapred.TestJobClientGetJob): chmod: cannot
access `/tmp/hadoop-jenkins/mapred/staging/jenkins770626914/.staging/job_local_0001': No such
file or directory

Tests run: 30, Failures: 0, Errors: 3, Skipped: 0

[INFO] ------------------------------------------------------------------------
[INFO] Reactor Summary:
[INFO] 
[INFO] hadoop-yarn ....................................... SUCCESS [1.462s]
[INFO] hadoop-yarn-api ................................... SUCCESS [8.573s]
[INFO] hadoop-yarn-common ................................ SUCCESS [22.209s]
[INFO] hadoop-yarn-server ................................ SUCCESS [0.103s]
[INFO] hadoop-yarn-server-common ......................... SUCCESS [4.200s]
[INFO] hadoop-yarn-server-nodemanager .................... SUCCESS [1:59.807s]
[INFO] hadoop-yarn-server-web-proxy ...................... SUCCESS [0.986s]
[INFO] hadoop-yarn-server-resourcemanager ................ SUCCESS [2:45.613s]
[INFO] hadoop-yarn-server-tests .......................... SUCCESS [40.535s]
[INFO] hadoop-mapreduce-client ........................... SUCCESS [0.058s]
[INFO] hadoop-mapreduce-client-core ...................... SUCCESS [7.445s]
[INFO] hadoop-yarn-applications .......................... SUCCESS [0.074s]
[INFO] hadoop-yarn-applications-distributedshell ......... SUCCESS [23.351s]
[INFO] hadoop-yarn-site .................................. SUCCESS [0.139s]
[INFO] hadoop-mapreduce-client-common .................... FAILURE [9.938s]
[INFO] hadoop-mapreduce-client-shuffle ................... SKIPPED
[INFO] hadoop-mapreduce-client-app ....................... SKIPPED
[INFO] hadoop-mapreduce-client-hs ........................ SKIPPED
[INFO] hadoop-mapreduce-client-jobclient ................. SKIPPED
[INFO] Apache Hadoop MapReduce Examples .................. SKIPPED
[INFO] hadoop-mapreduce .................................. SKIPPED
[INFO] ------------------------------------------------------------------------
[INFO] BUILD FAILURE
[INFO] ------------------------------------------------------------------------
[INFO] Total time: 6:45.109s
[INFO] Finished at: Tue Jan 10 13:20:33 UTC 2012
[INFO] Final Memory: 73M/549M
[INFO] ------------------------------------------------------------------------
[ERROR] Failed to execute goal org.apache.maven.plugins:maven-surefire-plugin:2.10:test (default-test)
on project hadoop-mapreduce-client-common: There are test failures.
[ERROR] 
[ERROR] Please refer to /home/jenkins/jenkins-slave/workspace/Hadoop-Mapreduce-trunk/trunk/hadoop-mapreduce-project/hadoop-mapreduce-client/hadoop-mapreduce-client-common/target/surefire-reports
for the individual test results.
[ERROR] -> [Help 1]
[ERROR] 
[ERROR] To see the full stack trace of the errors, re-run Maven with the -e switch.
[ERROR] Re-run Maven using the -X switch to enable full debug logging.
[ERROR] 
[ERROR] For more information about the errors and possible solutions, please read the following
articles:
[ERROR] [Help 1] http://cwiki.apache.org/confluence/display/MAVEN/MojoFailureException
[ERROR] 
[ERROR] After correcting the problems, you can resume the build with the command
[ERROR]   mvn <goals> -rf :hadoop-mapreduce-client-common
Build step 'Execute shell' marked build as failure
[FINDBUGS] Skipping publisher since build result is FAILURE
Archiving artifacts
Updating MAPREDUCE-3312
Updating MAPREDUCE-3528
Updating HADOOP-7963
Updating MAPREDUCE-3511
Updating MAPREDUCE-3616
Updating MAPREDUCE-3639
Email was triggered for: Failure
Sending email for trigger: Failure



###################################################################################
############################## FAILED TESTS (if any) ##############################
No tests ran.

Mime
View raw message