hadoop-mapreduce-dev mailing list archives

Site index · List index
Message view « Date » · « Thread »
Top « Date » · « Thread »
From Apache Jenkins Server <jenk...@builds.apache.org>
Subject Hadoop-Mapreduce-trunk - Build # 950 - Still Failing
Date Fri, 06 Jan 2012 13:22:29 GMT
See https://builds.apache.org/job/Hadoop-Mapreduce-trunk/950/

###################################################################################
########################## LAST 60 LINES OF THE CONSOLE ###########################
[...truncated 25729 lines...]
[INFO] hadoop-yarn-api ................................... SUCCESS [8.176s]
[INFO] hadoop-yarn-common ................................ SUCCESS [22.203s]
[INFO] hadoop-yarn-server ................................ SUCCESS [0.112s]
[INFO] hadoop-yarn-server-common ......................... SUCCESS [4.308s]
[INFO] hadoop-yarn-server-nodemanager .................... SUCCESS [1:59.971s]
[INFO] hadoop-yarn-server-web-proxy ...................... SUCCESS [0.713s]
[INFO] hadoop-yarn-server-resourcemanager ................ SUCCESS [2:44.470s]
[INFO] hadoop-yarn-server-tests .......................... SUCCESS [39.562s]
[INFO] hadoop-mapreduce-client ........................... SUCCESS [0.058s]
[INFO] hadoop-mapreduce-client-core ...................... SUCCESS [7.180s]
[INFO] hadoop-yarn-applications .......................... SUCCESS [0.082s]
[INFO] hadoop-yarn-applications-distributedshell ......... SUCCESS [23.409s]
[INFO] hadoop-yarn-site .................................. SUCCESS [0.147s]
[INFO] hadoop-mapreduce-client-common .................... FAILURE [9.806s]
[INFO] hadoop-mapreduce-client-shuffle ................... SKIPPED
[INFO] hadoop-mapreduce-client-app ....................... SKIPPED
[INFO] hadoop-mapreduce-client-hs ........................ SKIPPED
[INFO] hadoop-mapreduce-client-jobclient ................. SKIPPED
[INFO] Apache Hadoop MapReduce Examples .................. SKIPPED
[INFO] hadoop-mapreduce .................................. SKIPPED
[INFO] ------------------------------------------------------------------------
[INFO] BUILD FAILURE
[INFO] ------------------------------------------------------------------------
[INFO] Total time: 6:42.345s
[INFO] Finished at: Fri Jan 06 13:20:45 UTC 2012
[INFO] Final Memory: 74M/668M
[INFO] ------------------------------------------------------------------------
[ERROR] Failed to execute goal org.apache.maven.plugins:maven-surefire-plugin:2.10:test (default-test)
on project hadoop-mapreduce-client-common: There are test failures.
[ERROR] 
[ERROR] Please refer to /home/jenkins/jenkins-slave/workspace/Hadoop-Mapreduce-trunk/trunk/hadoop-mapreduce-project/hadoop-mapreduce-client/hadoop-mapreduce-client-common/target/surefire-reports
for the individual test results.
[ERROR] -> [Help 1]
[ERROR] 
[ERROR] To see the full stack trace of the errors, re-run Maven with the -e switch.
[ERROR] Re-run Maven using the -X switch to enable full debug logging.
[ERROR] 
[ERROR] For more information about the errors and possible solutions, please read the following
articles:
[ERROR] [Help 1] http://cwiki.apache.org/confluence/display/MAVEN/MojoFailureException
[ERROR] 
[ERROR] After correcting the problems, you can resume the build with the command
[ERROR]   mvn <goals> -rf :hadoop-mapreduce-client-common
Build step 'Execute shell' marked build as failure
[FINDBUGS] Skipping publisher since build result is FAILURE
Archiving artifacts
Updating MAPREDUCE-3326
Updating HADOOP-4515
Updating HADOOP-7808
Updating HADOOP-7510
Updating MAPREDUCE-3548
Updating HDFS-2710
Updating HADOOP-7907
Updating HADOOP-7934
Updating HADOOP-7933
Updating HADOOP-7936
Updating HDFS-2697
Updating HADOOP-7957
Updating MAPREDUCE-3615
Updating MAPREDUCE-3617
Email was triggered for: Failure
Sending email for trigger: Failure



###################################################################################
############################## FAILED TESTS (if any) ##############################
No tests ran.

Mime
View raw message