hadoop-mapreduce-dev mailing list archives

Site index · List index
Message view « Date » · « Thread »
Top « Date » · « Thread »
From Apache Jenkins Server <jenk...@builds.apache.org>
Subject Hadoop-Mapreduce-trunk - Build # 949 - Failure
Date Thu, 05 Jan 2012 13:22:38 GMT
See https://builds.apache.org/job/Hadoop-Mapreduce-trunk/949/

###################################################################################
########################## LAST 60 LINES OF THE CONSOLE ###########################
[...truncated 25544 lines...]
[INFO] Reactor Summary:
[INFO] 
[INFO] hadoop-yarn ....................................... SUCCESS [1.492s]
[INFO] hadoop-yarn-api ................................... SUCCESS [8.685s]
[INFO] hadoop-yarn-common ................................ SUCCESS [22.092s]
[INFO] hadoop-yarn-server ................................ SUCCESS [0.105s]
[INFO] hadoop-yarn-server-common ......................... SUCCESS [4.231s]
[INFO] hadoop-yarn-server-nodemanager .................... SUCCESS [1:59.027s]
[INFO] hadoop-yarn-server-web-proxy ...................... SUCCESS [0.675s]
[INFO] hadoop-yarn-server-resourcemanager ................ SUCCESS [2:43.765s]
[INFO] hadoop-yarn-server-tests .......................... SUCCESS [39.482s]
[INFO] hadoop-mapreduce-client ........................... SUCCESS [0.061s]
[INFO] hadoop-mapreduce-client-core ...................... SUCCESS [7.410s]
[INFO] hadoop-yarn-applications .......................... SUCCESS [0.080s]
[INFO] hadoop-yarn-applications-distributedshell ......... SUCCESS [23.311s]
[INFO] hadoop-yarn-site .................................. SUCCESS [0.145s]
[INFO] hadoop-mapreduce-client-common .................... FAILURE [9.751s]
[INFO] hadoop-mapreduce-client-shuffle ................... SKIPPED
[INFO] hadoop-mapreduce-client-app ....................... SKIPPED
[INFO] hadoop-mapreduce-client-hs ........................ SKIPPED
[INFO] hadoop-mapreduce-client-jobclient ................. SKIPPED
[INFO] Apache Hadoop MapReduce Examples .................. SKIPPED
[INFO] hadoop-mapreduce .................................. SKIPPED
[INFO] ------------------------------------------------------------------------
[INFO] BUILD FAILURE
[INFO] ------------------------------------------------------------------------
[INFO] Total time: 6:40.923s
[INFO] Finished at: Thu Jan 05 13:20:47 UTC 2012
[INFO] Final Memory: 63M/421M
[INFO] ------------------------------------------------------------------------
[ERROR] Failed to execute goal org.apache.maven.plugins:maven-surefire-plugin:2.10:test (default-test)
on project hadoop-mapreduce-client-common: There are test failures.
[ERROR] 
[ERROR] Please refer to /home/jenkins/jenkins-slave/workspace/Hadoop-Mapreduce-trunk/trunk/hadoop-mapreduce-project/hadoop-mapreduce-client/hadoop-mapreduce-client-common/target/surefire-reports
for the individual test results.
[ERROR] -> [Help 1]
[ERROR] 
[ERROR] To see the full stack trace of the errors, re-run Maven with the -e switch.
[ERROR] Re-run Maven using the -X switch to enable full debug logging.
[ERROR] 
[ERROR] For more information about the errors and possible solutions, please read the following
articles:
[ERROR] [Help 1] http://cwiki.apache.org/confluence/display/MAVEN/MojoFailureException
[ERROR] 
[ERROR] After correcting the problems, you can resume the build with the command
[ERROR]   mvn <goals> -rf :hadoop-mapreduce-client-common
Build step 'Execute shell' marked build as failure
[FINDBUGS] Skipping publisher since build result is FAILURE
Archiving artifacts
Updating MAPREDUCE-3566
Updating MAPREDUCE-3529
Updating MAPREDUCE-3490
Updating MAPREDUCE-1744
Updating MAPREDUCE-3478
Updating HADOOP-7948
Updating HADOOP-7949
Updating HDFS-1314
Updating MAPREDUCE-3595
Updating MAPREDUCE-3572
Updating MAPREDUCE-3569
Email was triggered for: Failure
Sending email for trigger: Failure



###################################################################################
############################## FAILED TESTS (if any) ##############################
No tests ran.

Mime
View raw message