hadoop-mapreduce-dev mailing list archives

Site index · List index
Message view « Date » · « Thread »
Top « Date » · « Thread »
From Apache Jenkins Server <jenk...@builds.apache.org>
Subject Hadoop-Mapreduce-0.23-Build - Build # 158 - Still Failing
Date Thu, 12 Jan 2012 13:15:52 GMT
See https://builds.apache.org/job/Hadoop-Mapreduce-0.23-Build/158/

###################################################################################
########################## LAST 60 LINES OF THE CONSOLE ###########################
[...truncated 24674 lines...]
[INFO] ------------------------------------------------------------------------
[INFO] ------------------------------------------------------------------------
[INFO] Reactor Summary:
[INFO] 
[INFO] hadoop-yarn ....................................... SUCCESS [1.914s]
[INFO] hadoop-yarn-api ................................... FAILURE [0.194s]
[INFO] hadoop-yarn-common ................................ SKIPPED
[INFO] hadoop-yarn-server ................................ SKIPPED
[INFO] hadoop-yarn-server-common ......................... SKIPPED
[INFO] hadoop-yarn-server-nodemanager .................... SKIPPED
[INFO] hadoop-yarn-server-web-proxy ...................... SKIPPED
[INFO] hadoop-yarn-server-resourcemanager ................ SKIPPED
[INFO] hadoop-yarn-server-tests .......................... SKIPPED
[INFO] hadoop-mapreduce-client ........................... SKIPPED
[INFO] hadoop-mapreduce-client-core ...................... SKIPPED
[INFO] hadoop-yarn-applications .......................... SKIPPED
[INFO] hadoop-yarn-applications-distributedshell ......... SKIPPED
[INFO] hadoop-yarn-site .................................. SKIPPED
[INFO] hadoop-mapreduce-client-common .................... SKIPPED
[INFO] hadoop-mapreduce-client-shuffle ................... SKIPPED
[INFO] hadoop-mapreduce-client-app ....................... SKIPPED
[INFO] hadoop-mapreduce-client-hs ........................ SKIPPED
[INFO] hadoop-mapreduce-client-jobclient ................. SKIPPED
[INFO] Apache Hadoop MapReduce Examples .................. SKIPPED
[INFO] hadoop-mapreduce .................................. SKIPPED
[INFO] ------------------------------------------------------------------------
[INFO] BUILD FAILURE
[INFO] ------------------------------------------------------------------------
[INFO] Total time: 3.376s
[INFO] Finished at: Thu Jan 12 13:14:01 UTC 2012
[INFO] Final Memory: 19M/181M
[INFO] ------------------------------------------------------------------------
[ERROR] Failed to execute goal com.atlassian.maven.plugins:maven-clover2-plugin:3.0.5:setup
(default-cli) on project hadoop-yarn-api: Execution default-cli of goal com.atlassian.maven.plugins:maven-clover2-plugin:3.0.5:setup
failed: Could not find any valid decoders in [clover.com.atlassian.extras.decoder.v2.Version2LicenseDecoder@6d75b6,
clover.com.atlassian.extras.decoder.v1.Version1LicenseDecoder@4b3f8b] for license string </home/jenkins/tools/clover/latest/lib/clover.license>
-> [Help 1]
[ERROR] 
[ERROR] To see the full stack trace of the errors, re-run Maven with the -e switch.
[ERROR] Re-run Maven using the -X switch to enable full debug logging.
[ERROR] 
[ERROR] For more information about the errors and possible solutions, please read the following
articles:
[ERROR] [Help 1] http://cwiki.apache.org/confluence/display/MAVEN/PluginExecutionException
[ERROR] 
[ERROR] After correcting the problems, you can resume the build with the command
[ERROR]   mvn <goals> -rf :hadoop-yarn-api
+ [[ 2 -ne 0 ]]
+ echo 'Build failed'
Build failed
+ exit 1
Build step 'Execute shell' marked build as failure
Archiving artifacts
Updating MAPREDUCE-3645
Updating MAPREDUCE-3553
Updating HDFS-69
Updating MAPREDUCE-3651
Updating MAPREDUCE-3652
Updating MAPREDUCE-3625
Updating HADOOP-7964
Updating MAPREDUCE-3512
Updating MAPREDUCE-3648
Email was triggered for: Failure
Sending email for trigger: Failure



###################################################################################
############################## FAILED TESTS (if any) ##############################
No tests ran.

Mime
View raw message