hadoop-mapreduce-dev mailing list archives

Site index · List index
Message view « Date » · « Thread »
Top « Date » · « Thread »
From Apache Jenkins Server <jenk...@builds.apache.org>
Subject Hadoop-Mapreduce-0.23-Build - Build # 147 - Still Failing
Date Sun, 01 Jan 2012 13:15:56 GMT
See https://builds.apache.org/job/Hadoop-Mapreduce-0.23-Build/147/

###################################################################################
########################## LAST 60 LINES OF THE CONSOLE ###########################
[...truncated 24350 lines...]
[INFO] hadoop-yarn ....................................... FAILURE [1.249s]
[INFO] hadoop-yarn-api ................................... SKIPPED
[INFO] hadoop-yarn-common ................................ SKIPPED
[INFO] hadoop-yarn-server ................................ SKIPPED
[INFO] hadoop-yarn-server-common ......................... SKIPPED
[INFO] hadoop-yarn-server-nodemanager .................... SKIPPED
[INFO] hadoop-yarn-server-web-proxy ...................... SKIPPED
[INFO] hadoop-yarn-server-resourcemanager ................ SKIPPED
[INFO] hadoop-yarn-server-tests .......................... SKIPPED
[INFO] hadoop-mapreduce-client ........................... SKIPPED
[INFO] hadoop-mapreduce-client-core ...................... SKIPPED
[INFO] hadoop-yarn-applications .......................... SKIPPED
[INFO] hadoop-yarn-applications-distributedshell ......... SKIPPED
[INFO] hadoop-yarn-site .................................. SKIPPED
[INFO] hadoop-mapreduce-client-common .................... SKIPPED
[INFO] hadoop-mapreduce-client-shuffle ................... SKIPPED
[INFO] hadoop-mapreduce-client-app ....................... SKIPPED
[INFO] hadoop-mapreduce-client-hs ........................ SKIPPED
[INFO] hadoop-mapreduce-client-jobclient ................. SKIPPED
[INFO] Apache Hadoop MapReduce Examples .................. SKIPPED
[INFO] hadoop-mapreduce .................................. SKIPPED
[INFO] ------------------------------------------------------------------------
[INFO] BUILD FAILURE
[INFO] ------------------------------------------------------------------------
[INFO] Total time: 3.292s
[INFO] Finished at: Sun Jan 01 13:14:11 UTC 2012
[INFO] Final Memory: 15M/116M
[INFO] ------------------------------------------------------------------------
[ERROR] Failed to execute goal com.atlassian.maven.plugins:maven-clover2-plugin:3.0.2:setup
(default-cli) on project hadoop-yarn: Could not resolve the clover artifact ( com.cenqua.clover:clover:jar:3.0.2
) in the localRepository: file:///home/jenkins/.m2/repository/: Could not find artifact com.cenqua.clover:clover:jar:3.0.2
[ERROR] 
[ERROR] Try downloading the file manually from the project website.
[ERROR] 
[ERROR] Then, install it using the command:
[ERROR] mvn install:install-file -DgroupId=com.cenqua.clover -DartifactId=clover -Dversion=3.0.2
-Dpackaging=jar -Dfile=/path/to/file
[ERROR] 
[ERROR] Alternatively, if you host your own repository you can deploy the file there:
[ERROR] mvn deploy:deploy-file -DgroupId=com.cenqua.clover -DartifactId=clover -Dversion=3.0.2
-Dpackaging=jar -Dfile=/path/to/file -Durl=[url] -DrepositoryId=[id]
[ERROR] 
[ERROR] 
[ERROR] com.cenqua.clover:clover:jar:3.0.2
[ERROR] 
[ERROR] from the specified remote repositories:
[ERROR] (none)
[ERROR] -> [Help 1]
[ERROR] 
[ERROR] To see the full stack trace of the errors, re-run Maven with the -e switch.
[ERROR] Re-run Maven using the -X switch to enable full debug logging.
[ERROR] 
[ERROR] For more information about the errors and possible solutions, please read the following
articles:
[ERROR] [Help 1] http://cwiki.apache.org/confluence/display/MAVEN/MojoExecutionException
+ [[ 2 -ne 0 ]]
+ echo 'Build failed'
Build failed
+ exit 1
Build step 'Execute shell' marked build as failure
Archiving artifacts
Updating HDFS-2574
Email was triggered for: Failure
Sending email for trigger: Failure



###################################################################################
############################## FAILED TESTS (if any) ##############################
No tests ran.

Mime
View raw message