hadoop-mapreduce-dev mailing list archives

Site index · List index
Message view « Date » · « Thread »
Top « Date » · « Thread »
From Apache Jenkins Server <jenk...@builds.apache.org>
Subject Hadoop-Mapreduce-22-branch - Build # 95 - Failure
Date Mon, 12 Dec 2011 10:31:38 GMT
See https://builds.apache.org/job/Hadoop-Mapreduce-22-branch/95/

###################################################################################
########################## LAST 60 LINES OF THE CONSOLE ###########################
[...truncated 2395 lines...]
[ivy:resolve] :: problems summary ::
[ivy:resolve] :::: WARNINGS
[ivy:resolve] 		module not found: org.apache.hadoop#hadoop-common;0.22.0-SNAPSHOT
[ivy:resolve] 	==== apache-snapshot: tried
[ivy:resolve] 	  https://repository.apache.org/content/repositories/snapshots/org/apache/hadoop/hadoop-common/0.22.0-SNAPSHOT/hadoop-common-0.22.0-SNAPSHOT.pom
[ivy:resolve] 	  -- artifact org.apache.hadoop#hadoop-common;0.22.0-SNAPSHOT!hadoop-common.jar:
[ivy:resolve] 	  https://repository.apache.org/content/repositories/snapshots/org/apache/hadoop/hadoop-common/0.22.0-SNAPSHOT/hadoop-common-0.22.0-SNAPSHOT.jar
[ivy:resolve] 	==== maven2: tried
[ivy:resolve] 	  http://repo1.maven.org/maven2/org/apache/hadoop/hadoop-common/0.22.0-SNAPSHOT/hadoop-common-0.22.0-SNAPSHOT.pom
[ivy:resolve] 	  -- artifact org.apache.hadoop#hadoop-common;0.22.0-SNAPSHOT!hadoop-common.jar:
[ivy:resolve] 	  http://repo1.maven.org/maven2/org/apache/hadoop/hadoop-common/0.22.0-SNAPSHOT/hadoop-common-0.22.0-SNAPSHOT.jar
[ivy:resolve] 		module not found: org.apache.hadoop#hadoop-common-test;0.22.0-SNAPSHOT
[ivy:resolve] 	==== apache-snapshot: tried
[ivy:resolve] 	  https://repository.apache.org/content/repositories/snapshots/org/apache/hadoop/hadoop-common-test/0.22.0-SNAPSHOT/hadoop-common-test-0.22.0-SNAPSHOT.pom
[ivy:resolve] 	  -- artifact org.apache.hadoop#hadoop-common-test;0.22.0-SNAPSHOT!hadoop-common-test.jar:
[ivy:resolve] 	  https://repository.apache.org/content/repositories/snapshots/org/apache/hadoop/hadoop-common-test/0.22.0-SNAPSHOT/hadoop-common-test-0.22.0-SNAPSHOT.jar
[ivy:resolve] 	==== maven2: tried
[ivy:resolve] 	  http://repo1.maven.org/maven2/org/apache/hadoop/hadoop-common-test/0.22.0-SNAPSHOT/hadoop-common-test-0.22.0-SNAPSHOT.pom
[ivy:resolve] 	  -- artifact org.apache.hadoop#hadoop-common-test;0.22.0-SNAPSHOT!hadoop-common-test.jar:
[ivy:resolve] 	  http://repo1.maven.org/maven2/org/apache/hadoop/hadoop-common-test/0.22.0-SNAPSHOT/hadoop-common-test-0.22.0-SNAPSHOT.jar
[ivy:resolve] 		module not found: org.apache.hadoop#hadoop-hdfs;0.22.0-SNAPSHOT
[ivy:resolve] 	==== apache-snapshot: tried
[ivy:resolve] 	  https://repository.apache.org/content/repositories/snapshots/org/apache/hadoop/hadoop-hdfs/0.22.0-SNAPSHOT/hadoop-hdfs-0.22.0-SNAPSHOT.pom
[ivy:resolve] 	  -- artifact org.apache.hadoop#hadoop-hdfs;0.22.0-SNAPSHOT!hadoop-hdfs.jar:
[ivy:resolve] 	  https://repository.apache.org/content/repositories/snapshots/org/apache/hadoop/hadoop-hdfs/0.22.0-SNAPSHOT/hadoop-hdfs-0.22.0-SNAPSHOT.jar
[ivy:resolve] 	==== maven2: tried
[ivy:resolve] 	  http://repo1.maven.org/maven2/org/apache/hadoop/hadoop-hdfs/0.22.0-SNAPSHOT/hadoop-hdfs-0.22.0-SNAPSHOT.pom
[ivy:resolve] 	  -- artifact org.apache.hadoop#hadoop-hdfs;0.22.0-SNAPSHOT!hadoop-hdfs.jar:
[ivy:resolve] 	  http://repo1.maven.org/maven2/org/apache/hadoop/hadoop-hdfs/0.22.0-SNAPSHOT/hadoop-hdfs-0.22.0-SNAPSHOT.jar
[ivy:resolve] 		::::::::::::::::::::::::::::::::::::::::::::::
[ivy:resolve] 		::          UNRESOLVED DEPENDENCIES         ::
[ivy:resolve] 		::::::::::::::::::::::::::::::::::::::::::::::
[ivy:resolve] 		:: org.apache.hadoop#hadoop-common;0.22.0-SNAPSHOT: not found
[ivy:resolve] 		:: org.apache.hadoop#hadoop-common-test;0.22.0-SNAPSHOT: not found
[ivy:resolve] 		:: org.apache.hadoop#hadoop-hdfs;0.22.0-SNAPSHOT: not found
[ivy:resolve] 		::::::::::::::::::::::::::::::::::::::::::::::
[ivy:resolve] 
[ivy:resolve] :: USE VERBOSE OR DEBUG MESSAGE LEVEL FOR MORE DETAILS

BUILD FAILED
/home/jenkins/jenkins-slave/workspace/Hadoop-Mapreduce-22-branch/trunk/build.xml:2117: impossible
to resolve dependencies:
	resolve failed - see output for details

Total time: 14 seconds
+ RESULT=1
+ [ 1 != 0 ]
+ echo Build Failed: remaining tests not run
Build Failed: remaining tests not run
+ exit 1
Build step 'Execute shell' marked build as failure
[FINDBUGS] Skipping publisher since build result is FAILURE
Archiving artifacts
Publishing Clover coverage report...
No Clover report will be published due to a Build Failure
Recording test results
Publishing Javadoc
Recording fingerprints
Email was triggered for: Failure
Sending email for trigger: Failure



###################################################################################
############################## FAILED TESTS (if any) ##############################
No tests ran.

Mime
View raw message