hadoop-mapreduce-dev mailing list archives

Site index · List index
Message view « Date » · « Thread »
Top « Date » · « Thread »
From Apache Jenkins Server <jenk...@builds.apache.org>
Subject Hadoop-Mapreduce-0.23-Build - Build # 144 - Failure
Date Thu, 29 Dec 2011 23:37:08 GMT
See https://builds.apache.org/job/Hadoop-Mapreduce-0.23-Build/144/

###################################################################################
########################## LAST 60 LINES OF THE CONSOLE ###########################
[...truncated 15549 lines...]
[INFO] hadoop-yarn-applications-distributedshell ......... SKIPPED
[INFO] hadoop-yarn-site .................................. SKIPPED
[INFO] hadoop-mapreduce-client-common .................... SKIPPED
[INFO] hadoop-mapreduce-client-shuffle ................... SKIPPED
[INFO] hadoop-mapreduce-client-app ....................... SKIPPED
[INFO] hadoop-mapreduce-client-hs ........................ SKIPPED
[INFO] hadoop-mapreduce-client-jobclient ................. SKIPPED
[INFO] Apache Hadoop MapReduce Examples .................. SKIPPED
[INFO] hadoop-mapreduce .................................. SKIPPED
[INFO] Apache Hadoop MapReduce Streaming ................. SKIPPED
[INFO] Apache Hadoop Archives ............................ SKIPPED
[INFO] Apache Hadoop Tools ............................... SKIPPED
[INFO] Apache Hadoop Distribution ........................ SKIPPED
[INFO] ------------------------------------------------------------------------
[INFO] BUILD FAILURE
[INFO] ------------------------------------------------------------------------
[INFO] Total time: 6:47.415s
[INFO] Finished at: Thu Dec 29 23:37:00 UTC 2011
[INFO] Final Memory: 101M/760M
[INFO] ------------------------------------------------------------------------
[ERROR] Failed to execute goal org.apache.maven.plugins:maven-compiler-plugin:2.3.2:testCompile
(default-testCompile) on project hadoop-yarn-server-resourcemanager: Compilation failure:
Compilation failure:
[ERROR] /home/jenkins/jenkins-slave/workspace/Hadoop-Mapreduce-0.23-Build/trunk/hadoop-mapreduce-project/hadoop-yarn/hadoop-yarn-server/hadoop-yarn-server-resourcemanager/src/test/java/org/apache/hadoop/yarn/server/resourcemanager/webapp/TestRMWebServicesCapacitySched.java:[96,36]
cannot find symbol
[ERROR] symbol  : variable ROOT
[ERROR] location: class org.apache.hadoop.yarn.server.resourcemanager.scheduler.capacity.CapacityScheduler
[ERROR] /home/jenkins/jenkins-slave/workspace/Hadoop-Mapreduce-0.23-Build/trunk/hadoop-mapreduce-project/hadoop-yarn/hadoop-yarn-server/hadoop-yarn-server-resourcemanager/src/test/java/org/apache/hadoop/yarn/server/resourcemanager/webapp/TestRMWebServicesCapacitySched.java:[97,38]
cannot find symbol
[ERROR] symbol  : variable ROOT
[ERROR] location: class org.apache.hadoop.yarn.server.resourcemanager.scheduler.capacity.CapacityScheduler
[ERROR] /home/jenkins/jenkins-slave/workspace/Hadoop-Mapreduce-0.23-Build/trunk/hadoop-mapreduce-project/hadoop-yarn/hadoop-yarn-server/hadoop-yarn-server-resourcemanager/src/test/java/org/apache/hadoop/yarn/server/resourcemanager/webapp/TestRMWebServicesCapacitySched.java:[99,38]
cannot find symbol
[ERROR] symbol  : variable ROOT
[ERROR] location: class org.apache.hadoop.yarn.server.resourcemanager.scheduler.capacity.CapacityScheduler
[ERROR] /home/jenkins/jenkins-slave/workspace/Hadoop-Mapreduce-0.23-Build/trunk/hadoop-mapreduce-project/hadoop-yarn/hadoop-yarn-server/hadoop-yarn-server-resourcemanager/src/test/java/org/apache/hadoop/yarn/server/resourcemanager/webapp/TestRMWebServicesCapacitySched.java:[103,38]
cannot find symbol
[ERROR] symbol  : variable ROOT
[ERROR] location: class org.apache.hadoop.yarn.server.resourcemanager.scheduler.capacity.CapacityScheduler
[ERROR] /home/jenkins/jenkins-slave/workspace/Hadoop-Mapreduce-0.23-Build/trunk/hadoop-mapreduce-project/hadoop-yarn/hadoop-yarn-server/hadoop-yarn-server-resourcemanager/src/test/java/org/apache/hadoop/yarn/server/resourcemanager/webapp/TestRMWebServicesCapacitySched.java:[212,36]
cannot find symbol
[ERROR] symbol  : variable ROOT
[ERROR] location: class org.apache.hadoop.yarn.server.resourcemanager.scheduler.capacity.CapacityScheduler
[ERROR] /home/jenkins/jenkins-slave/workspace/Hadoop-Mapreduce-0.23-Build/trunk/hadoop-mapreduce-project/hadoop-yarn/hadoop-yarn-server/hadoop-yarn-server-resourcemanager/src/test/java/org/apache/hadoop/yarn/server/resourcemanager/webapp/TestRMWebServicesCapacitySched.java:[256,34]
cannot find symbol
[ERROR] symbol  : variable ROOT
[ERROR] location: class org.apache.hadoop.yarn.server.resourcemanager.scheduler.capacity.CapacityScheduler
[ERROR] -> [Help 1]
[ERROR] 
[ERROR] To see the full stack trace of the errors, re-run Maven with the -e switch.
[ERROR] Re-run Maven using the -X switch to enable full debug logging.
[ERROR] 
[ERROR] For more information about the errors and possible solutions, please read the following
articles:
[ERROR] [Help 1] http://cwiki.apache.org/confluence/display/MAVEN/MojoFailureException
[ERROR] 
[ERROR] After correcting the problems, you can resume the build with the command
[ERROR]   mvn <goals> -rf :hadoop-yarn-server-resourcemanager
+ RESULT=1
+ [[ 1 -ne 0 ]]
+ echo 'mvn clean install package -Pdist,native -Dtar failed'
mvn clean install package -Pdist,native -Dtar failed
+ exit 1
Build step 'Execute shell' marked build as failure
Archiving artifacts
Updating MAPREDUCE-3522
Email was triggered for: Failure
Sending email for trigger: Failure



###################################################################################
############################## FAILED TESTS (if any) ##############################
No tests ran.

Mime
View raw message