hadoop-mapreduce-dev mailing list archives

Site index · List index
Message view « Date » · « Thread »
Top « Date » · « Thread »
From Apache Jenkins Server <jenk...@builds.apache.org>
Subject Hadoop-Mapreduce-trunk - Build # 928 - Failure
Date Thu, 15 Dec 2011 15:39:02 GMT
See https://builds.apache.org/job/Hadoop-Mapreduce-trunk/928/

###################################################################################
########################## LAST 60 LINES OF THE CONSOLE ###########################
[...truncated 25801 lines...]

[INFO] ------------------------------------------------------------------------
[INFO] Reactor Summary:
[INFO] 
[INFO] hadoop-yarn ....................................... SUCCESS [1.496s]
[INFO] hadoop-yarn-api ................................... SUCCESS [8.225s]
[INFO] hadoop-yarn-common ................................ SUCCESS [22.818s]
[INFO] hadoop-yarn-server ................................ SUCCESS [0.105s]
[INFO] hadoop-yarn-server-common ......................... SUCCESS [4.298s]
[INFO] hadoop-yarn-server-nodemanager .................... SUCCESS [1:48.050s]
[INFO] hadoop-yarn-server-web-proxy ...................... SUCCESS [0.583s]
[INFO] hadoop-yarn-server-resourcemanager ................ SUCCESS [2:24.053s]
[INFO] hadoop-yarn-server-tests .......................... SUCCESS [39.217s]
[INFO] hadoop-mapreduce-client ........................... SUCCESS [0.062s]
[INFO] hadoop-mapreduce-client-core ...................... SUCCESS [6.644s]
[INFO] hadoop-yarn-applications .......................... SUCCESS [0.078s]
[INFO] hadoop-yarn-applications-distributedshell ......... SUCCESS [24.225s]
[INFO] hadoop-yarn-site .................................. SUCCESS [0.145s]
[INFO] hadoop-mapreduce-client-common .................... SUCCESS [15.958s]
[INFO] hadoop-mapreduce-client-shuffle ................... SUCCESS [1.003s]
[INFO] hadoop-mapreduce-client-app ....................... FAILURE [2:09.337s]
[INFO] hadoop-mapreduce-client-hs ........................ SKIPPED
[INFO] hadoop-mapreduce-client-jobclient ................. SKIPPED
[INFO] Apache Hadoop MapReduce Examples .................. SKIPPED
[INFO] hadoop-mapreduce .................................. SKIPPED
[INFO] ------------------------------------------------------------------------
[INFO] BUILD FAILURE
[INFO] ------------------------------------------------------------------------
[INFO] Total time: 8:26.967s
[INFO] Finished at: Thu Dec 15 15:26:31 UTC 2011
[INFO] Final Memory: 63M/411M
[INFO] ------------------------------------------------------------------------
[ERROR] Failed to execute goal org.apache.maven.plugins:maven-surefire-plugin:2.10:test (default-test)
on project hadoop-mapreduce-client-app: There are test failures.
[ERROR] 
[ERROR] Please refer to /home/jenkins/jenkins-slave/workspace/Hadoop-Mapreduce-trunk/trunk/hadoop-mapreduce-project/hadoop-mapreduce-client/hadoop-mapreduce-client-app/target/surefire-reports
for the individual test results.
[ERROR] -> [Help 1]
[ERROR] 
[ERROR] To see the full stack trace of the errors, re-run Maven with the -e switch.
[ERROR] Re-run Maven using the -X switch to enable full debug logging.
[ERROR] 
[ERROR] For more information about the errors and possible solutions, please read the following
articles:
[ERROR] [Help 1] http://cwiki.apache.org/confluence/display/MAVEN/MojoFailureException
[ERROR] 
[ERROR] After correcting the problems, you can resume the build with the command
[ERROR]   mvn <goals> -rf :hadoop-mapreduce-client-app
Build step 'Execute shell' marked build as failure
[FINDBUGS] Skipping publisher since build result is FAILURE
Archiving artifacts
Updating MAPREDUCE-3484
Updating MAPREDUCE-3541
Updating MAPREDUCE-3398
Updating MAPREDUCE-3251
Updating MAPREDUCE-3557
Updating MAPREDUCE-3531
Updating MAPREDUCE-3530
Updating HADOOP-7920
Updating MAPREDUCE-3560
Email was triggered for: Failure
Sending email for trigger: Failure



###################################################################################
############################## FAILED TESTS (if any) ##############################
No tests ran.

Mime
View raw message