hadoop-mapreduce-dev mailing list archives

Site index · List index
Message view « Date » · « Thread »
Top « Date » · « Thread »
From Todd Lipcon <t...@cloudera.com>
Subject Re: Hadoop-Mapreduce-trunk-Commit - Build # 1175 - Still Failing
Date Tue, 01 Nov 2011 06:17:54 GMT
For config management purposes: we also need libc6-dev-i386 for the
32-bit cross-compiles to work.

-Todd

On Fri, Oct 28, 2011 at 11:51 AM, giridharan kesavan
<gkesavan@hortonworks.com> wrote:
> I 've added hadoop5 to the mapreduce build pool, which is causing this. I'm
> lookin into this.
> -Giri
>
> On 10/28/11 11:05 AM, Todd Lipcon wrote:
>>
>> Not sure exactly what changed on 10/26, but our MR builds are now
>> failing because they can't find libcrypto.so. The odd thing is that
>> libcrypto.so is indeed installed on the build boxes (both 32-bit and
>> 64-bit).
>>
>> Any ideas?
>>
>> On Wed, Oct 26, 2011 at 5:07 PM, Apache Jenkins Server
>> <jenkins@builds.apache.org>  wrote:
>>>
>>> See https://builds.apache.org/job/Hadoop-Mapreduce-trunk-Commit/1175/
>>>
>>>
>>> ###################################################################################
>>> ########################## LAST 60 LINES OF THE CONSOLE
>>> ###########################
>>> [...truncated 10036 lines...]
>>>    [touch] Creating /tmp/null1185950683
>>>   [delete] Deleting: /tmp/null1185950683
>>>    [unzip] Expanding:
>>> /home/jenkins/jenkins-slave/workspace/Hadoop-Mapreduce-trunk-Commit/trunk/hadoop-mapreduce-project/build/ivy/lib/Hadoop/common/hadoop-hdfs-0.24.0-SNAPSHOT.jar
>>> into
>>> /home/jenkins/jenkins-slave/workspace/Hadoop-Mapreduce-trunk-Commit/trunk/hadoop-mapreduce-project/build
>>>
>>> check-c++-configure:
>>>
>>> create-c++-pipes-configure:
>>>     [exec] checking for a BSD-compatible install... /usr/bin/install -c
>>>     [exec] checking whether build environment is sane... yes
>>>     [exec] checking for a thread-safe mkdir -p... /bin/mkdir -p
>>>     [exec] checking for gawk... no
>>>     [exec] checking for mawk... mawk
>>>     [exec] checking whether make sets $(MAKE)... yes
>>>     [exec] checking for style of include used by make... GNU
>>>     [exec] checking for gcc... gcc
>>>     [exec] checking whether the C compiler works... yes
>>>     [exec] checking for C compiler default output file name... a.out
>>>     [exec] checking for suffix of executables...
>>>     [exec] checking whether we are cross compiling... no
>>>     [exec] checking for suffix of object files... o
>>>     [exec] checking whether we are using the GNU C compiler... yes
>>>     [exec] checking whether gcc accepts -g... yes
>>>     [exec] checking for gcc option to accept ISO C89... none needed
>>>     [exec] checking dependency style of gcc... gcc3
>>>     [exec] checking how to run the C preprocessor... gcc -E
>>>     [exec] checking for grep that handles long lines and -e... /bin/grep
>>>     [exec] checking for egrep... /bin/grep -E
>>>     [exec] checking for ANSI C header files... yes
>>>     [exec] checking for sys/types.h... yes
>>>     [exec] checking for sys/stat.h... yes
>>>     [exec] checking for stdlib.h... yes
>>>     [exec] checking for string.h... yes
>>>     [exec] checking for memory.h... yes
>>>     [exec] checking for strings.h... yes
>>>     [exec] checking for inttypes.h... yes
>>>     [exec] checking for stdint.h... yes
>>>     [exec] checking for unistd.h... yes
>>>     [exec] checking minix/config.h usability... no
>>>     [exec] checking minix/config.h presence... no
>>>     [exec] checking for minix/config.h... no
>>>     [exec] checking whether it is safe to define __EXTENSIONS__... yes
>>>     [exec] checking for special C compiler options needed for large
>>> files... no
>>>     [exec] checking for _FILE_OFFSET_BITS value needed for large files...
>>> no
>>>     [exec] checking pthread.h usability... yes
>>>     [exec] checking pthread.h presence... yes
>>>     [exec] checking for pthread.h... yes
>>>     [exec] checking for pthread_create in -lpthread... yes
>>>     [exec] checking for HMAC_Init in -lcrypto... no
>>>     [exec]
>>> /home/jenkins/jenkins-slave/workspace/Hadoop-Mapreduce-trunk-Commit/trunk/hadoop-mapreduce-project/src/c++/pipes/configure:
>>> line 266: return: please: numeric argument required
>>>     [exec] configure: error: Cannot find libcrypto.so
>>>
>>> BUILD FAILED
>>>
>>> /home/jenkins/jenkins-slave/workspace/Hadoop-Mapreduce-trunk-Commit/trunk/hadoop-mapreduce-project/build.xml:1916:
>>> exec returned: 255
>>>
>>> Total time: 29 seconds
>>> Build step 'Execute shell' marked build as failure
>>> Recording test results
>>> Email was triggered for: Failure
>>> Sending email for trigger: Failure
>>>
>>>
>>>
>>>
>>> ###################################################################################
>>> ############################## FAILED TESTS (if any)
>>> ##############################
>>> All tests passed
>>>
>>
>>
>
>
> --
> -Giri
>
>



-- 
Todd Lipcon
Software Engineer, Cloudera

Mime
View raw message