hadoop-mapreduce-dev mailing list archives

Site index · List index
Message view « Date » · « Thread »
Top « Date » · « Thread »
From Apache Jenkins Server <jenk...@builds.apache.org>
Subject Hadoop-Mapreduce-trunk - Build # 901 - Failure
Date Fri, 18 Nov 2011 13:42:22 GMT
See https://builds.apache.org/job/Hadoop-Mapreduce-trunk/901/

###################################################################################
########################## LAST 60 LINES OF THE CONSOLE ###########################
[...truncated 23220 lines...]
  org.apache.hadoop.mapreduce.v2.TestUberAM: Failed to Start org.apache.hadoop.mapreduce.v2.TestMRJobs

Tests run: 19, Failures: 3, Errors: 2, Skipped: 0

[INFO] ------------------------------------------------------------------------
[INFO] Reactor Summary:
[INFO] 
[INFO] hadoop-yarn ....................................... SUCCESS [1.432s]
[INFO] hadoop-yarn-api ................................... SUCCESS [7.990s]
[INFO] hadoop-yarn-common ................................ SUCCESS [22.058s]
[INFO] hadoop-yarn-server ................................ SUCCESS [0.103s]
[INFO] hadoop-yarn-server-common ......................... SUCCESS [8.862s]
[INFO] hadoop-yarn-server-nodemanager .................... SUCCESS [1:21.965s]
[INFO] hadoop-yarn-server-web-proxy ...................... SUCCESS [0.560s]
[INFO] hadoop-yarn-server-resourcemanager ................ SUCCESS [1:25.151s]
[INFO] hadoop-yarn-server-tests .......................... SUCCESS [21.472s]
[INFO] hadoop-mapreduce-client ........................... SUCCESS [0.062s]
[INFO] hadoop-mapreduce-client-core ...................... SUCCESS [5.663s]
[INFO] hadoop-yarn-applications .......................... SUCCESS [0.071s]
[INFO] hadoop-yarn-applications-distributedshell ......... SUCCESS [24.240s]
[INFO] hadoop-yarn-site .................................. SUCCESS [0.133s]
[INFO] hadoop-mapreduce-client-common .................... SUCCESS [14.534s]
[INFO] hadoop-mapreduce-client-shuffle ................... SUCCESS [1.015s]
[INFO] hadoop-mapreduce-client-app ....................... SUCCESS [2:04.957s]
[INFO] hadoop-mapreduce-client-hs ........................ SUCCESS [14.281s]
[INFO] hadoop-mapreduce-client-jobclient ................. FAILURE [20:48.154s]
[INFO] hadoop-mapreduce .................................. SKIPPED
[INFO] ------------------------------------------------------------------------
[INFO] BUILD FAILURE
[INFO] ------------------------------------------------------------------------
[INFO] Total time: 27:43.292s
[INFO] Finished at: Fri Nov 18 13:40:31 UTC 2011
[INFO] Final Memory: 72M/677M
[INFO] ------------------------------------------------------------------------
[ERROR] Failed to execute goal org.apache.maven.plugins:maven-surefire-plugin:2.9:test (default-test)
on project hadoop-mapreduce-client-jobclient: Failure or timeout -> [Help 1]
[ERROR] 
[ERROR] To see the full stack trace of the errors, re-run Maven with the -e switch.
[ERROR] Re-run Maven using the -X switch to enable full debug logging.
[ERROR] 
[ERROR] For more information about the errors and possible solutions, please read the following
articles:
[ERROR] [Help 1] http://cwiki.apache.org/confluence/display/MAVEN/MojoExecutionException
[ERROR] 
[ERROR] After correcting the problems, you can resume the build with the command
[ERROR]   mvn <goals> -rf :hadoop-mapreduce-client-jobclient
Build step 'Execute shell' marked build as failure
[FINDBUGS] Skipping publisher since build result is FAILURE
Archiving artifacts
Updating MAPREDUCE-3415
Updating MAPREDUCE-3169
Updating HADOOP-7787
Updating HADOOP-7802
Updating MAPREDUCE-3373
Updating MAPREDUCE-3372
Updating HDFS-2560
Updating HDFS-2543
Updating HDFS-2544
Updating HDFS-2562
Email was triggered for: Failure
Sending email for trigger: Failure



###################################################################################
############################## FAILED TESTS (if any) ##############################
No tests ran.

Mime
View raw message