hadoop-mapreduce-dev mailing list archives

Site index · List index
Message view « Date » · « Thread »
Top « Date » · « Thread »
From Apache Jenkins Server <jenk...@builds.apache.org>
Subject Hadoop-Mapreduce-trunk - Build # 884 - Still Failing
Date Tue, 01 Nov 2011 13:21:38 GMT
See https://builds.apache.org/job/Hadoop-Mapreduce-trunk/884/

###################################################################################
########################## LAST 60 LINES OF THE CONSOLE ###########################
[...truncated 12463 lines...]
[INFO] hadoop-yarn-server-tests .......................... SUCCESS [22.737s]
[INFO] hadoop-yarn-applications .......................... SUCCESS [0.058s]
[INFO] hadoop-yarn-applications-distributedshell ......... SUCCESS [23.761s]
[INFO] hadoop-yarn-site .................................. SUCCESS [0.132s]
[INFO] hadoop-mapreduce-client ........................... SUCCESS [0.066s]
[INFO] hadoop-mapreduce-client-core ...................... SUCCESS [5.699s]
[INFO] hadoop-mapreduce-client-common .................... SUCCESS [14.535s]
[INFO] hadoop-mapreduce-client-shuffle ................... SUCCESS [1.087s]
[INFO] hadoop-mapreduce-client-app ....................... SUCCESS [2:04.936s]
[INFO] hadoop-mapreduce-client-hs ........................ SUCCESS [14.628s]
[INFO] hadoop-mapreduce-client-jobclient ................. FAILURE [4:56.887s]
[INFO] hadoop-mapreduce .................................. SKIPPED
[INFO] ------------------------------------------------------------------------
[INFO] BUILD FAILURE
[INFO] ------------------------------------------------------------------------
[INFO] Total time: 11:44.674s
[INFO] Finished at: Tue Nov 01 13:19:57 UTC 2011
[INFO] Final Memory: 61M/522M
[INFO] ------------------------------------------------------------------------
[ERROR] Failed to execute goal org.apache.maven.plugins:maven-surefire-plugin:2.9:test (default-test)
on project hadoop-mapreduce-client-jobclient: There are test failures.
[ERROR] 
[ERROR] Please refer to /home/jenkins/jenkins-slave/workspace/Hadoop-Mapreduce-trunk/trunk/hadoop-mapreduce-project/hadoop-mapreduce-client/hadoop-mapreduce-client-jobclient/target/surefire-reports
for the individual test results.
[ERROR] -> [Help 1]
[ERROR] 
[ERROR] To see the full stack trace of the errors, re-run Maven with the -e switch.
[ERROR] Re-run Maven using the -X switch to enable full debug logging.
[ERROR] 
[ERROR] For more information about the errors and possible solutions, please read the following
articles:
[ERROR] [Help 1] http://cwiki.apache.org/confluence/display/MAVEN/MojoFailureException
[ERROR] 
[ERROR] After correcting the problems, you can resume the build with the command
[ERROR]   mvn <goals> -rf :hadoop-mapreduce-client-jobclient
Build step 'Execute shell' marked build as failure
[FINDBUGS] Skipping publisher since build result is FAILURE
Archiving artifacts
Updating HDFS-2521
Updating MAPREDUCE-3322
Updating MAPREDUCE-3321
Updating MAPREDUCE-3035
Updating HDFS-2385
Updating MAPREDUCE-3103
Updating HDFS-2512
Updating HDFS-2065
Updating HADOOP-7360
Updating HADOOP-7782
Updating MAPREDUCE-3220
Updating MAPREDUCE-3237
Updating HADOOP-7785
Updating HDFS-2038
Updating HDFS-2334
Updating HADOOP-7789
Updating HDFS-2002
Updating MAPREDUCE-3275
Updating MAPREDUCE-3316
Updating MAPREDUCE-3317
Updating HADOOP-7771
Updating MAPREDUCE-3241
Email was triggered for: Failure
Sending email for trigger: Failure



###################################################################################
############################## FAILED TESTS (if any) ##############################
No tests ran.

Mime
View raw message