hadoop-mapreduce-dev mailing list archives

Site index · List index
Message view « Date » · « Thread »
Top « Date » · « Thread »
From Apache Jenkins Server <jenk...@builds.apache.org>
Subject Hadoop-Mapreduce-trunk - Build # 902 - Still Failing
Date Sat, 19 Nov 2011 13:41:16 GMT
See https://builds.apache.org/job/Hadoop-Mapreduce-trunk/902/

###################################################################################
########################## LAST 60 LINES OF THE CONSOLE ###########################
[...truncated 24189 lines...]
Failed tests:   testSleepJob(org.apache.hadoop.mapreduce.v2.TestMRJobs)
  testRandomWriter(org.apache.hadoop.mapreduce.v2.TestMRJobs)
  testDistributedCache(org.apache.hadoop.mapreduce.v2.TestMRJobs)

Tests in error: 
  org.apache.hadoop.mapreduce.v2.TestMROldApiJobs: Failed to Start org.apache.hadoop.mapreduce.v2.TestMROldApiJobs
  org.apache.hadoop.mapreduce.v2.TestUberAM: Failed to Start org.apache.hadoop.mapreduce.v2.TestMRJobs

Tests run: 19, Failures: 3, Errors: 2, Skipped: 0

[INFO] ------------------------------------------------------------------------
[INFO] Reactor Summary:
[INFO] 
[INFO] hadoop-yarn ....................................... SUCCESS [2.545s]
[INFO] hadoop-yarn-api ................................... SUCCESS [7.856s]
[INFO] hadoop-yarn-common ................................ SUCCESS [21.182s]
[INFO] hadoop-yarn-server ................................ SUCCESS [0.103s]
[INFO] hadoop-yarn-server-common ......................... SUCCESS [8.865s]
[INFO] hadoop-yarn-server-nodemanager .................... SUCCESS [1:22.050s]
[INFO] hadoop-yarn-server-web-proxy ...................... SUCCESS [0.589s]
[INFO] hadoop-yarn-server-resourcemanager ................ SUCCESS [1:25.265s]
[INFO] hadoop-yarn-server-tests .......................... SUCCESS [21.486s]
[INFO] hadoop-mapreduce-client ........................... SUCCESS [0.060s]
[INFO] hadoop-mapreduce-client-core ...................... SUCCESS [5.470s]
[INFO] hadoop-yarn-applications .......................... SUCCESS [0.072s]
[INFO] hadoop-yarn-applications-distributedshell ......... SUCCESS [24.257s]
[INFO] hadoop-yarn-site .................................. SUCCESS [0.134s]
[INFO] hadoop-mapreduce-client-common .................... SUCCESS [14.591s]
[INFO] hadoop-mapreduce-client-shuffle ................... SUCCESS [1.023s]
[INFO] hadoop-mapreduce-client-app ....................... SUCCESS [2:07.006s]
[INFO] hadoop-mapreduce-client-hs ........................ SUCCESS [14.278s]
[INFO] hadoop-mapreduce-client-jobclient ................. FAILURE [20:54.711s]
[INFO] Apache Hadoop MapReduce Examples .................. SKIPPED
[INFO] hadoop-mapreduce .................................. SKIPPED
[INFO] ------------------------------------------------------------------------
[INFO] BUILD FAILURE
[INFO] ------------------------------------------------------------------------
[INFO] Total time: 27:52.155s
[INFO] Finished at: Sat Nov 19 13:39:52 UTC 2011
[INFO] Final Memory: 72M/403M
[INFO] ------------------------------------------------------------------------
[ERROR] Failed to execute goal org.apache.maven.plugins:maven-surefire-plugin:2.9:test (default-test)
on project hadoop-mapreduce-client-jobclient: Failure or timeout -> [Help 1]
[ERROR] 
[ERROR] To see the full stack trace of the errors, re-run Maven with the -e switch.
[ERROR] Re-run Maven using the -X switch to enable full debug logging.
[ERROR] 
[ERROR] For more information about the errors and possible solutions, please read the following
articles:
[ERROR] [Help 1] http://cwiki.apache.org/confluence/display/MAVEN/MojoExecutionException
[ERROR] 
[ERROR] After correcting the problems, you can resume the build with the command
[ERROR]   mvn <goals> -rf :hadoop-mapreduce-client-jobclient
Build step 'Execute shell' marked build as failure
[FINDBUGS] Skipping publisher since build result is FAILURE
Archiving artifacts
Updating HADOOP-7590
Updating HDFS-2563
Updating HDFS-2564
Email was triggered for: Failure
Sending email for trigger: Failure



###################################################################################
############################## FAILED TESTS (if any) ##############################
No tests ran.

Mime
View raw message