hadoop-mapreduce-dev mailing list archives

Site index · List index
Message view « Date » · « Thread »
Top « Date » · « Thread »
From Apache Jenkins Server <jenk...@builds.apache.org>
Subject Hadoop-Mapreduce-trunk - Build # 903 - Still Failing
Date Sun, 20 Nov 2011 13:41:08 GMT
See https://builds.apache.org/job/Hadoop-Mapreduce-trunk/903/

###################################################################################
########################## LAST 60 LINES OF THE CONSOLE ###########################
[...truncated 24202 lines...]
  org.apache.hadoop.mapreduce.v2.TestMROldApiJobs: Failed to Start org.apache.hadoop.mapreduce.v2.TestMROldApiJobs
  org.apache.hadoop.mapreduce.v2.TestUberAM: Failed to Start org.apache.hadoop.mapreduce.v2.TestMRJobs

Tests run: 19, Failures: 3, Errors: 2, Skipped: 0

[INFO] ------------------------------------------------------------------------
[INFO] Reactor Summary:
[INFO] 
[INFO] hadoop-yarn ....................................... SUCCESS [1.399s]
[INFO] hadoop-yarn-api ................................... SUCCESS [8.179s]
[INFO] hadoop-yarn-common ................................ SUCCESS [21.167s]
[INFO] hadoop-yarn-server ................................ SUCCESS [0.103s]
[INFO] hadoop-yarn-server-common ......................... SUCCESS [8.752s]
[INFO] hadoop-yarn-server-nodemanager .................... SUCCESS [1:22.244s]
[INFO] hadoop-yarn-server-web-proxy ...................... SUCCESS [0.593s]
[INFO] hadoop-yarn-server-resourcemanager ................ SUCCESS [1:25.632s]
[INFO] hadoop-yarn-server-tests .......................... SUCCESS [22.473s]
[INFO] hadoop-mapreduce-client ........................... SUCCESS [0.062s]
[INFO] hadoop-mapreduce-client-core ...................... SUCCESS [5.722s]
[INFO] hadoop-yarn-applications .......................... SUCCESS [0.073s]
[INFO] hadoop-yarn-applications-distributedshell ......... SUCCESS [24.228s]
[INFO] hadoop-yarn-site .................................. SUCCESS [0.144s]
[INFO] hadoop-mapreduce-client-common .................... SUCCESS [14.624s]
[INFO] hadoop-mapreduce-client-shuffle ................... SUCCESS [1.016s]
[INFO] hadoop-mapreduce-client-app ....................... SUCCESS [2:05.185s]
[INFO] hadoop-mapreduce-client-hs ........................ SUCCESS [14.346s]
[INFO] hadoop-mapreduce-client-jobclient ................. FAILURE [20:48.339s]
[INFO] Apache Hadoop MapReduce Examples .................. SKIPPED
[INFO] hadoop-mapreduce .................................. SKIPPED
[INFO] ------------------------------------------------------------------------
[INFO] BUILD FAILURE
[INFO] ------------------------------------------------------------------------
[INFO] Total time: 27:44.895s
[INFO] Finished at: Sun Nov 20 13:39:44 UTC 2011
[INFO] Final Memory: 72M/500M
[INFO] ------------------------------------------------------------------------
[ERROR] Failed to execute goal org.apache.maven.plugins:maven-surefire-plugin:2.9:test (default-test)
on project hadoop-mapreduce-client-jobclient: Failure or timeout -> [Help 1]
[ERROR] 
[ERROR] To see the full stack trace of the errors, re-run Maven with the -e switch.
[ERROR] Re-run Maven using the -X switch to enable full debug logging.
[ERROR] 
[ERROR] For more information about the errors and possible solutions, please read the following
articles:
[ERROR] [Help 1] http://cwiki.apache.org/confluence/display/MAVEN/MojoExecutionException
[ERROR] 
[ERROR] After correcting the problems, you can resume the build with the command
[ERROR]   mvn <goals> -rf :hadoop-mapreduce-client-jobclient
Build step 'Execute shell' marked build as failure
[FINDBUGS] Skipping publisher since build result is FAILURE
Archiving artifacts
Updating HDFS-2454
Updating HDFS-2567
Updating HDFS-2568
Updating HDFS-208
Updating HDFS-2502
Updating HDFS-2541
Updating HDFS-2536
Updating HDFS-2570
Email was triggered for: Failure
Sending email for trigger: Failure



###################################################################################
############################## FAILED TESTS (if any) ##############################
No tests ran.

Mime
View raw message