hadoop-mapreduce-dev mailing list archives

Site index · List index
Message view « Date » · « Thread »
Top « Date » · « Thread »
From Apache Jenkins Server <jenk...@builds.apache.org>
Subject Hadoop-Mapreduce-trunk - Build # 885 - Still Failing
Date Wed, 02 Nov 2011 13:34:41 GMT
See https://builds.apache.org/job/Hadoop-Mapreduce-trunk/885/

###################################################################################
########################## LAST 60 LINES OF THE CONSOLE ###########################
[...truncated 12449 lines...]
  testDistributedCache(org.apache.hadoop.mapreduce.v2.TestMRJobs)

Tests run: 22, Failures: 3, Errors: 0, Skipped: 0

[INFO] ------------------------------------------------------------------------
[INFO] Reactor Summary:
[INFO] 
[INFO] hadoop-yarn ....................................... SUCCESS [1.433s]
[INFO] hadoop-yarn-api ................................... SUCCESS [8.240s]
[INFO] hadoop-yarn-common ................................ SUCCESS [21.060s]
[INFO] hadoop-yarn-server ................................ SUCCESS [0.105s]
[INFO] hadoop-yarn-server-common ......................... SUCCESS [8.704s]
[INFO] hadoop-yarn-server-nodemanager .................... SUCCESS [1:20.714s]
[INFO] hadoop-yarn-server-web-proxy ...................... SUCCESS [0.574s]
[INFO] hadoop-yarn-server-resourcemanager ................ SUCCESS [1:18.310s]
[INFO] hadoop-yarn-server-tests .......................... SUCCESS [21.477s]
[INFO] hadoop-yarn-applications .......................... SUCCESS [0.061s]
[INFO] hadoop-yarn-applications-distributedshell ......... SUCCESS [23.771s]
[INFO] hadoop-yarn-site .................................. SUCCESS [0.152s]
[INFO] hadoop-mapreduce-client ........................... SUCCESS [0.061s]
[INFO] hadoop-mapreduce-client-core ...................... SUCCESS [5.955s]
[INFO] hadoop-mapreduce-client-common .................... SUCCESS [15.472s]
[INFO] hadoop-mapreduce-client-shuffle ................... SUCCESS [1.036s]
[INFO] hadoop-mapreduce-client-app ....................... SUCCESS [2:07.728s]
[INFO] hadoop-mapreduce-client-hs ........................ SUCCESS [14.235s]
[INFO] hadoop-mapreduce-client-jobclient ................. FAILURE [17:36.383s]
[INFO] hadoop-mapreduce .................................. SKIPPED
[INFO] ------------------------------------------------------------------------
[INFO] BUILD FAILURE
[INFO] ------------------------------------------------------------------------
[INFO] Total time: 24:26.065s
[INFO] Finished at: Wed Nov 02 13:32:55 UTC 2011
[INFO] Final Memory: 63M/508M
[INFO] ------------------------------------------------------------------------
[ERROR] Failed to execute goal org.apache.maven.plugins:maven-surefire-plugin:2.9:test (default-test)
on project hadoop-mapreduce-client-jobclient: There are test failures.
[ERROR] 
[ERROR] Please refer to /home/jenkins/jenkins-slave/workspace/Hadoop-Mapreduce-trunk/trunk/hadoop-mapreduce-project/hadoop-mapreduce-client/hadoop-mapreduce-client-jobclient/target/surefire-reports
for the individual test results.
[ERROR] -> [Help 1]
[ERROR] 
[ERROR] To see the full stack trace of the errors, re-run Maven with the -e switch.
[ERROR] Re-run Maven using the -X switch to enable full debug logging.
[ERROR] 
[ERROR] For more information about the errors and possible solutions, please read the following
articles:
[ERROR] [Help 1] http://cwiki.apache.org/confluence/display/MAVEN/MojoFailureException
[ERROR] 
[ERROR] After correcting the problems, you can resume the build with the command
[ERROR]   mvn <goals> -rf :hadoop-mapreduce-client-jobclient
Build step 'Execute shell' marked build as failure
[FINDBUGS] Skipping publisher since build result is FAILURE
Archiving artifacts
Updating HADOOP-7792
Updating HDFS-2416
Updating HDFS-2308
Updating HADOOP-7786
Updating HADOOP-7789
Updating MAPREDUCE-3332
Updating HDFS-2526
Email was triggered for: Failure
Sending email for trigger: Failure



###################################################################################
############################## FAILED TESTS (if any) ##############################
No tests ran.

Mime
View raw message