hadoop-mapreduce-dev mailing list archives

Site index · List index
Message view « Date » · « Thread »
Top « Date » · « Thread »
From Apache Jenkins Server <jenk...@builds.apache.org>
Subject Hadoop-Mapreduce-22-branch - Build # 79 - Still Failing
Date Sat, 01 Oct 2011 01:08:21 GMT
See https://builds.apache.org/job/Hadoop-Mapreduce-22-branch/79/

###################################################################################
########################## LAST 60 LINES OF THE CONSOLE ###########################
[...truncated 192770 lines...]
    [junit]    0.95:96670
    [junit] Failed Reduce CDF --------
    [junit] 0: -9223372036854775808--9223372036854775807
    [junit] map attempts to success -- 0.6567164179104478, 0.3283582089552239, 0.014925373134328358,

    [junit] ===============
    [junit] 2011-10-01 01:04:12,308 WARN  rumen.ZombieJob (ZombieJob.java:sanitizeLoggedTask(318))
- Task task_200904211745_0004_r_000025 has nulll TaskStatus
    [junit] 2011-10-01 01:04:12,308 WARN  rumen.ZombieJob (ZombieJob.java:sanitizeLoggedTask(318))
- Task task_200904211745_0004_r_000028 has nulll TaskStatus
    [junit] 2011-10-01 01:04:12,309 WARN  rumen.ZombieJob (ZombieJob.java:sanitizeLoggedTask(318))
- Task task_200904211745_0004_r_000029 has nulll TaskStatus
    [junit] 2011-10-01 01:04:12,309 WARN  rumen.ZombieJob (ZombieJob.java:sanitizeLoggedTask(318))
- Task task_200904211745_0004_r_000030 has nulll TaskStatus
    [junit] 2011-10-01 01:04:12,309 WARN  rumen.ZombieJob (ZombieJob.java:sanitizeLoggedTask(318))
- Task task_200904211745_0004_r_000031 has nulll TaskStatus
    [junit] 2011-10-01 01:04:12,309 WARN  rumen.ZombieJob (ZombieJob.java:sanitizeLoggedTask(318))
- Task task_200904211745_0004_r_000032 has nulll TaskStatus
    [junit] 2011-10-01 01:04:12,310 WARN  rumen.ZombieJob (ZombieJob.java:sanitizeLoggedTask(318))
- Task task_200904211745_0004_r_000033 has nulll TaskStatus
    [junit] 2011-10-01 01:04:12,310 WARN  rumen.ZombieJob (ZombieJob.java:sanitizeLoggedTask(318))
- Task task_200904211745_0004_r_000034 has nulll TaskStatus
    [junit] 2011-10-01 01:04:12,310 WARN  rumen.ZombieJob (ZombieJob.java:sanitizeLoggedTask(318))
- Task task_200904211745_0004_r_000035 has nulll TaskStatus
    [junit] 2011-10-01 01:04:12,311 WARN  rumen.ZombieJob (ZombieJob.java:sanitizeLoggedTask(318))
- Task task_200904211745_0004_r_000036 has nulll TaskStatus
    [junit] 2011-10-01 01:04:12,311 WARN  rumen.ZombieJob (ZombieJob.java:sanitizeLoggedTask(318))
- Task task_200904211745_0004_r_000037 has nulll TaskStatus
    [junit] 2011-10-01 01:04:12,311 WARN  rumen.ZombieJob (ZombieJob.java:sanitizeLoggedTask(318))
- Task task_200904211745_0004_r_000038 has nulll TaskStatus
    [junit] 2011-10-01 01:04:12,311 WARN  rumen.ZombieJob (ZombieJob.java:sanitizeLoggedTask(318))
- Task task_200904211745_0004_r_000039 has nulll TaskStatus
    [junit] 2011-10-01 01:04:12,312 WARN  rumen.ZombieJob (ZombieJob.java:sanitizeLoggedTask(318))
- Task task_200904211745_0004_r_000040 has nulll TaskStatus
    [junit] 2011-10-01 01:04:12,312 WARN  rumen.ZombieJob (ZombieJob.java:sanitizeLoggedTask(318))
- Task task_200904211745_0004_r_000041 has nulll TaskStatus
    [junit] 2011-10-01 01:04:12,312 WARN  rumen.ZombieJob (ZombieJob.java:sanitizeLoggedTask(318))
- Task task_200904211745_0004_r_000042 has nulll TaskStatus
    [junit] 2011-10-01 01:04:12,312 WARN  rumen.ZombieJob (ZombieJob.java:sanitizeLoggedTask(318))
- Task task_200904211745_0004_r_000043 has nulll TaskStatus
    [junit] 2011-10-01 01:04:12,313 WARN  rumen.ZombieJob (ZombieJob.java:sanitizeLoggedTask(318))
- Task task_200904211745_0004_r_000044 has nulll TaskStatus
    [junit] 2011-10-01 01:04:12,313 WARN  rumen.ZombieJob (ZombieJob.java:sanitizeLoggedTask(318))
- Task task_200904211745_0004_r_000045 has nulll TaskStatus
    [junit] 2011-10-01 01:04:12,313 WARN  rumen.ZombieJob (ZombieJob.java:sanitizeLoggedTask(318))
- Task task_200904211745_0004_r_000046 has nulll TaskStatus
    [junit] generated failed map runtime distribution
    [junit] 100000: 18592--18592
    [junit]    0.1:18592
    [junit]    0.5:18592
    [junit]    0.9:18592
    [junit] Tests run: 5, Failures: 0, Errors: 0, Time elapsed: 1.793 sec
    [junit] Running org.apache.hadoop.util.TestReflectionUtils
    [junit] Tests run: 1, Failures: 0, Errors: 0, Time elapsed: 0.251 sec
    [junit] Running org.apache.hadoop.util.TestRunJar
    [junit] Creating file/home/jenkins/jenkins-slave/workspace/Hadoop-Mapreduce-22-branch/trunk/build/test/data/out
    [junit] Tests run: 1, Failures: 0, Errors: 0, Time elapsed: 0.211 sec

checkfailure:
    [touch] Creating /home/jenkins/jenkins-slave/workspace/Hadoop-Mapreduce-22-branch/trunk/build/test/testsfailed

run-test-mapred-all-withtestcaseonly:

run-test-mapred:

BUILD FAILED
/home/jenkins/jenkins-slave/workspace/Hadoop-Mapreduce-22-branch/trunk/build.xml:810: Tests
failed!

Total time: 141 minutes 17 seconds
Build step 'Execute shell' marked build as failure
[FINDBUGS] Skipping publisher since build result is FAILURE
Archiving artifacts
Publishing Clover coverage report...
No Clover report will be published due to a Build Failure
Recording test results
Publishing Javadoc
Recording fingerprints
Updating MAPREDUCE-2779
Email was triggered for: Failure
Sending email for trigger: Failure



###################################################################################
############################## FAILED TESTS (if any) ##############################
1 tests failed.
REGRESSION:  org.apache.hadoop.mapreduce.security.TestTokenCacheOldApi.testLocalJobTokenCache

Error Message:
Timeout occurred. Please note the time in the report does not reflect the time until the timeout.

Stack Trace:
junit.framework.AssertionFailedError: Timeout occurred. Please note the time in the report
does not reflect the time until the timeout.




Mime
View raw message