hadoop-mapreduce-dev mailing list archives

Site index · List index
Message view « Date » · « Thread »
Top « Date » · « Thread »
From Apache Jenkins Server <jenk...@builds.apache.org>
Subject Hadoop-Mapreduce-0.23-Commit - Build # 96 - Still Failing
Date Fri, 28 Oct 2011 08:21:59 GMT
See https://builds.apache.org/job/Hadoop-Mapreduce-0.23-Commit/96/

###################################################################################
########################## LAST 60 LINES OF THE CONSOLE ###########################
[...truncated 10964 lines...]
    [junit] Running org.apache.hadoop.mapred.TestMapRed
    [junit] Tests run: 5, Failures: 0, Errors: 0, Time elapsed: 22.129 sec
    [junit] Running org.apache.hadoop.mapred.TestMiniMRDFSCaching
    [junit] Tests run: 1, Failures: 0, Errors: 0, Time elapsed: 31.06 sec
    [junit] Running org.apache.hadoop.mapred.TestQueueAclsForCurrentUser
    [junit] Tests run: 3, Failures: 0, Errors: 0, Time elapsed: 0.617 sec
    [junit] Running org.apache.hadoop.mapred.TestRackAwareTaskPlacement
    [junit] Tests run: 1, Failures: 0, Errors: 0, Time elapsed: 1.54 sec
    [junit] Running org.apache.hadoop.mapred.TestReduceFetchFromPartialMem
    [junit] Tests run: 1, Failures: 0, Errors: 0, Time elapsed: 29.77 sec
    [junit] Running org.apache.hadoop.mapred.TestReduceTask
    [junit] Tests run: 2, Failures: 0, Errors: 0, Time elapsed: 0.644 sec
    [junit] Running org.apache.hadoop.mapred.TestSequenceFileAsBinaryInputFormat
    [junit] Tests run: 1, Failures: 0, Errors: 0, Time elapsed: 0.792 sec
    [junit] Running org.apache.hadoop.mapred.TestSequenceFileAsBinaryOutputFormat
    [junit] Tests run: 3, Failures: 0, Errors: 0, Time elapsed: 1.07 sec
    [junit] Running org.apache.hadoop.mapred.TestSequenceFileInputFormat
    [junit] Tests run: 1, Failures: 0, Errors: 0, Time elapsed: 4.812 sec
    [junit] Running org.apache.hadoop.mapred.TestSeveral
    [junit] Running org.apache.hadoop.mapred.TestSeveral
    [junit] Tests run: 1, Failures: 0, Errors: 1, Time elapsed: 0 sec
    [junit] Test org.apache.hadoop.mapred.TestSeveral FAILED (timeout)
    [junit] Running org.apache.hadoop.mapred.TestSpeculativeExecution
    [junit] Tests run: 5, Failures: 0, Errors: 0, Time elapsed: 4.354 sec
    [junit] Running org.apache.hadoop.mapred.TestTaskLimits
    [junit] Tests run: 3, Failures: 0, Errors: 0, Time elapsed: 3.908 sec
    [junit] Running org.apache.hadoop.mapred.TestTaskTrackerBlacklisting
    [junit] Tests run: 7, Failures: 0, Errors: 0, Time elapsed: 1.844 sec
    [junit] Running org.apache.hadoop.mapred.TestTextInputFormat
    [junit] Tests run: 8, Failures: 0, Errors: 0, Time elapsed: 73.7 sec
    [junit] Running org.apache.hadoop.mapred.TestTextOutputFormat
    [junit] Tests run: 2, Failures: 0, Errors: 0, Time elapsed: 0.19 sec
    [junit] Running org.apache.hadoop.mapred.TestTrackerBlacklistAcrossJobs
    [junit] Tests run: 1, Failures: 0, Errors: 0, Time elapsed: 41.878 sec
    [junit] Running org.apache.hadoop.mapreduce.TestCounters
    [junit] Tests run: 2, Failures: 0, Errors: 0, Time elapsed: 0.346 sec
    [junit] Running org.apache.hadoop.mapreduce.TestMapCollection
    [junit] Tests run: 11, Failures: 0, Errors: 0, Time elapsed: 21.137 sec
    [junit] Running org.apache.hadoop.mapreduce.TestMapReduceLocal
    [junit] Tests run: 1, Failures: 0, Errors: 0, Time elapsed: 26.967 sec
    [junit] Running org.apache.hadoop.mapreduce.lib.input.TestFileInputFormat
    [junit] Tests run: 2, Failures: 0, Errors: 0, Time elapsed: 0.978 sec
    [junit] Running org.apache.hadoop.mapreduce.lib.output.TestFileOutputCommitter
    [junit] Tests run: 3, Failures: 0, Errors: 0, Time elapsed: 0.635 sec

checkfailure:
    [touch] Creating /home/jenkins/jenkins-slave/workspace/Hadoop-Mapreduce-0.23-Commit/trunk/hadoop-mapreduce-project/build/test/testsfailed

BUILD FAILED
/home/jenkins/jenkins-slave/workspace/Hadoop-Mapreduce-0.23-Commit/trunk/hadoop-mapreduce-project/build.xml:780:
The following error occurred while executing this line:
/home/jenkins/jenkins-slave/workspace/Hadoop-Mapreduce-0.23-Commit/trunk/hadoop-mapreduce-project/build.xml:743:
The following error occurred while executing this line:
/home/jenkins/jenkins-slave/workspace/Hadoop-Mapreduce-0.23-Commit/trunk/hadoop-mapreduce-project/build.xml:804:
Tests failed!

Total time: 21 minutes 11 seconds
Build step 'Execute shell' marked build as failure
Recording test results
Updating MAPREDUCE-3296
Email was triggered for: Failure
Sending email for trigger: Failure



###################################################################################
############################## FAILED TESTS (if any) ##############################
All tests passed

Mime
View raw message