hadoop-mapreduce-dev mailing list archives

Site index · List index
Message view « Date » · « Thread »
Top « Date » · « Thread »
From Apache Jenkins Server <jenk...@builds.apache.org>
Subject Hadoop-Mapreduce-trunk - Build # 875 - Failure
Date Fri, 28 Oct 2011 01:54:12 GMT
See https://builds.apache.org/job/Hadoop-Mapreduce-trunk/875/

###################################################################################
########################## LAST 60 LINES OF THE CONSOLE ###########################
[...truncated 6521 lines...]
    [mkdir] Created dir: /home/jenkins/jenkins-slave/workspace/Hadoop-Mapreduce-trunk/trunk/hadoop-mapreduce-project/build/webapps/task/WEB-INF
    [mkdir] Created dir: /home/jenkins/jenkins-slave/workspace/Hadoop-Mapreduce-trunk/trunk/hadoop-mapreduce-project/build/webapps/job/WEB-INF
    [mkdir] Created dir: /home/jenkins/jenkins-slave/workspace/Hadoop-Mapreduce-trunk/trunk/hadoop-mapreduce-project/build/examples
    [mkdir] Created dir: /home/jenkins/jenkins-slave/workspace/Hadoop-Mapreduce-trunk/trunk/hadoop-mapreduce-project/build/c++
    [mkdir] Created dir: /home/jenkins/jenkins-slave/workspace/Hadoop-Mapreduce-trunk/trunk/hadoop-mapreduce-project/build/test
    [mkdir] Created dir: /home/jenkins/jenkins-slave/workspace/Hadoop-Mapreduce-trunk/trunk/hadoop-mapreduce-project/build/test/classes
    [mkdir] Created dir: /home/jenkins/jenkins-slave/workspace/Hadoop-Mapreduce-trunk/trunk/hadoop-mapreduce-project/build/test/extraconf
    [touch] Creating /tmp/null703877812
   [delete] Deleting: /tmp/null703877812
     [copy] Copying 6 files to /home/jenkins/jenkins-slave/workspace/Hadoop-Mapreduce-trunk/trunk/hadoop-mapreduce-project/build/webapps
    [unzip] Expanding: /home/jenkins/jenkins-slave/workspace/Hadoop-Mapreduce-trunk/trunk/hadoop-mapreduce-project/build/ivy/lib/Hadoop/common/hadoop-hdfs-0.24.0-SNAPSHOT.jar
into /home/jenkins/jenkins-slave/workspace/Hadoop-Mapreduce-trunk/trunk/hadoop-mapreduce-project/build
    [mkdir] Created dir: /home/jenkins/jenkins-slave/workspace/Hadoop-Mapreduce-trunk/trunk/hadoop-mapreduce-project/build/test/conf
     [copy] Copying 2 files to /home/jenkins/jenkins-slave/workspace/Hadoop-Mapreduce-trunk/trunk/hadoop-mapreduce-project/build/test/conf
     [copy] Copying /home/jenkins/jenkins-slave/workspace/Hadoop-Mapreduce-trunk/trunk/hadoop-mapreduce-project/conf/mapred-site.xml.template
to /home/jenkins/jenkins-slave/workspace/Hadoop-Mapreduce-trunk/trunk/hadoop-mapreduce-project/build/test/conf/mapred-site.xml
     [copy] Copying /home/jenkins/jenkins-slave/workspace/Hadoop-Mapreduce-trunk/trunk/hadoop-mapreduce-project/conf/mapred-queues.xml.template
to /home/jenkins/jenkins-slave/workspace/Hadoop-Mapreduce-trunk/trunk/hadoop-mapreduce-project/build/test/conf/mapred-queues.xml

check-c++-configure:

create-c++-utils-configure:

BUILD FAILED
/home/jenkins/jenkins-slave/workspace/Hadoop-Mapreduce-trunk/trunk/hadoop-mapreduce-project/build.xml:1537:
Execute failed: java.io.IOException: Cannot run program "autoreconf" (in directory "/home/jenkins/jenkins-slave/workspace/Hadoop-Mapreduce-trunk/trunk/hadoop-mapreduce-project/src/c++/utils"):
java.io.IOException: error=2, No such file or directory

Total time: 12 seconds
+ gunzip /home/jenkins/jenkins-slave/workspace/Hadoop-Mapreduce-trunk/trunk/hadoop-mapreduce-project/target/hadoop-mapreduce-0.24.0-SNAPSHOT-all.tar.gz
gzip: /home/jenkins/jenkins-slave/workspace/Hadoop-Mapreduce-trunk/trunk/hadoop-mapreduce-project/target/hadoop-mapreduce-0.24.0-SNAPSHOT-all.tar.gz:
No such file or directory
+ cd /home/jenkins/jenkins-slave/workspace/Hadoop-Mapreduce-trunk/trunk/hadoop-mapreduce-project/build/contrib/
/tmp/hudson3748464604512511041.sh: line 18: cd: /home/jenkins/jenkins-slave/workspace/Hadoop-Mapreduce-trunk/trunk/hadoop-mapreduce-project/build/contrib/:
No such file or directory
+ tar -rvf /home/jenkins/jenkins-slave/workspace/Hadoop-Mapreduce-trunk/trunk/hadoop-mapreduce-project/target/hadoop-mapreduce-0.24.0-SNAPSHOT-all.tar
gridmix/hadoop-0.24.0-SNAPSHOT-gridmix.jar
tar: /home/jenkins/jenkins-slave/workspace/Hadoop-Mapreduce-trunk/trunk/hadoop-mapreduce-project/target/hadoop-mapreduce-0.24.0-SNAPSHOT-all.tar:
Cannot read: Bad file descriptor
tar: At beginning of tape, quitting now
tar: Error is not recoverable: exiting now
+ tar -rvf /home/jenkins/jenkins-slave/workspace/Hadoop-Mapreduce-trunk/trunk/hadoop-mapreduce-project/target/hadoop-mapreduce-0.24.0-SNAPSHOT-all.tar
streaming/hadoop-0.24.0-SNAPSHOT-streaming.jar
tar: /home/jenkins/jenkins-slave/workspace/Hadoop-Mapreduce-trunk/trunk/hadoop-mapreduce-project/target/hadoop-mapreduce-0.24.0-SNAPSHOT-all.tar:
Cannot read: Bad file descriptor
tar: At beginning of tape, quitting now
tar: Error is not recoverable: exiting now
+ cd /home/jenkins/jenkins-slave/workspace/Hadoop-Mapreduce-trunk/trunk/hadoop-mapreduce-project
+ tar -rvf /home/jenkins/jenkins-slave/workspace/Hadoop-Mapreduce-trunk/trunk/hadoop-mapreduce-project/target/hadoop-mapreduce-0.24.0-SNAPSHOT-all.tar
build/hadoop-mapreduce-tools-0.24.0-SNAPSHOT.jar
tar: /home/jenkins/jenkins-slave/workspace/Hadoop-Mapreduce-trunk/trunk/hadoop-mapreduce-project/target/hadoop-mapreduce-0.24.0-SNAPSHOT-all.tar:
Cannot read: Bad file descriptor
tar: At beginning of tape, quitting now
tar: Error is not recoverable: exiting now
+ tar -rvf /home/jenkins/jenkins-slave/workspace/Hadoop-Mapreduce-trunk/trunk/hadoop-mapreduce-project/target/hadoop-mapreduce-0.24.0-SNAPSHOT-all.tar
build/hadoop-mapreduce-examples-0.24.0-SNAPSHOT.jar
tar: /home/jenkins/jenkins-slave/workspace/Hadoop-Mapreduce-trunk/trunk/hadoop-mapreduce-project/target/hadoop-mapreduce-0.24.0-SNAPSHOT-all.tar:
Cannot read: Bad file descriptor
tar: At beginning of tape, quitting now
tar: Error is not recoverable: exiting now
+ tar -rvf /home/jenkins/jenkins-slave/workspace/Hadoop-Mapreduce-trunk/trunk/hadoop-mapreduce-project/target/hadoop-mapreduce-0.24.0-SNAPSHOT-all.tar
build/hadoop-mapreduce-test-0.24.0-SNAPSHOT.jar
tar: /home/jenkins/jenkins-slave/workspace/Hadoop-Mapreduce-trunk/trunk/hadoop-mapreduce-project/target/hadoop-mapreduce-0.24.0-SNAPSHOT-all.tar:
Cannot read: Bad file descriptor
tar: At beginning of tape, quitting now
tar: Error is not recoverable: exiting now
+ gzip /home/jenkins/jenkins-slave/workspace/Hadoop-Mapreduce-trunk/trunk/hadoop-mapreduce-project/target/hadoop-mapreduce-0.24.0-SNAPSHOT-all.tar
gzip: /home/jenkins/jenkins-slave/workspace/Hadoop-Mapreduce-trunk/trunk/hadoop-mapreduce-project/target/hadoop-mapreduce-0.24.0-SNAPSHOT-all.tar:
No such file or directory
+ /home/jenkins/tools/maven/latest/bin/mvn install
/tmp/hudson3748464604512511041.sh: line 27: /home/jenkins/tools/maven/latest/bin/mvn: No such
file or directory
Build step 'Execute shell' marked build as failure
[FINDBUGS] Skipping publisher since build result is FAILURE
Archiving artifacts
Updating HDFS-2479
Email was triggered for: Failure
Sending email for trigger: Failure



###################################################################################
############################## FAILED TESTS (if any) ##############################
No tests ran.

Mime
View raw message