hadoop-mapreduce-dev mailing list archives

Site index · List index
Message view « Date » · « Thread »
Top « Date » · « Thread »
From Apache Jenkins Server <jenk...@builds.apache.org>
Subject Hadoop-Mapreduce-trunk - Build # 864 - Failure
Date Tue, 18 Oct 2011 13:14:05 GMT
See https://builds.apache.org/job/Hadoop-Mapreduce-trunk/864/

###################################################################################
########################## LAST 60 LINES OF THE CONSOLE ###########################
[...truncated 18918 lines...]
Tests in error: 
  testJobMonitorAndPrint(org.apache.hadoop.mapreduce.TestJobMonitorAndPrint)

Tests run: 15, Failures: 0, Errors: 1, Skipped: 0

[INFO] ------------------------------------------------------------------------
[INFO] Reactor Summary:
[INFO] 
[INFO] hadoop-yarn ....................................... SUCCESS [1.005s]
[INFO] hadoop-yarn-api ................................... SUCCESS [7.956s]
[INFO] hadoop-yarn-common ................................ SUCCESS [20.125s]
[INFO] hadoop-yarn-server ................................ SUCCESS [0.097s]
[INFO] hadoop-yarn-server-common ......................... SUCCESS [8.665s]
[INFO] hadoop-yarn-server-nodemanager .................... SUCCESS [50.047s]
[INFO] hadoop-yarn-server-resourcemanager ................ SUCCESS [1:00.248s]
[INFO] hadoop-yarn-server-tests .......................... SUCCESS [6.558s]
[INFO] hadoop-yarn-applications .......................... SUCCESS [0.059s]
[INFO] hadoop-yarn-applications-distributedshell ......... SUCCESS [13.970s]
[INFO] hadoop-yarn-site .................................. SUCCESS [0.142s]
[INFO] hadoop-mapreduce-client ........................... SUCCESS [0.059s]
[INFO] hadoop-mapreduce-client-core ...................... FAILURE [4.380s]
[INFO] hadoop-mapreduce-client-common .................... SKIPPED
[INFO] hadoop-mapreduce-client-shuffle ................... SKIPPED
[INFO] hadoop-mapreduce-client-app ....................... SKIPPED
[INFO] hadoop-mapreduce-client-hs ........................ SKIPPED
[INFO] hadoop-mapreduce-client-jobclient ................. SKIPPED
[INFO] hadoop-mapreduce .................................. SKIPPED
[INFO] ------------------------------------------------------------------------
[INFO] BUILD FAILURE
[INFO] ------------------------------------------------------------------------
[INFO] Total time: 2:53.828s
[INFO] Finished at: Tue Oct 18 13:13:53 UTC 2011
[INFO] Final Memory: 48M/228M
[INFO] ------------------------------------------------------------------------
[ERROR] Failed to execute goal org.apache.maven.plugins:maven-surefire-plugin:2.9:test (default-test)
on project hadoop-mapreduce-client-core: There are test failures.
[ERROR] 
[ERROR] Please refer to /home/jenkins/jenkins-slave/workspace/Hadoop-Mapreduce-trunk/trunk/hadoop-mapreduce-project/hadoop-mapreduce-client/hadoop-mapreduce-client-core/target/surefire-reports
for the individual test results.
[ERROR] -> [Help 1]
[ERROR] 
[ERROR] To see the full stack trace of the errors, re-run Maven with the -e switch.
[ERROR] Re-run Maven using the -X switch to enable full debug logging.
[ERROR] 
[ERROR] For more information about the errors and possible solutions, please read the following
articles:
[ERROR] [Help 1] http://cwiki.apache.org/confluence/display/MAVEN/MojoFailureException
[ERROR] 
[ERROR] After correcting the problems, you can resume the build with the command
[ERROR]   mvn <goals> -rf :hadoop-mapreduce-client-core
Build step 'Execute shell' marked build as failure
[FINDBUGS] Skipping publisher since build result is FAILURE
Archiving artifacts
Updating MAPREDUCE-279
Updating MAPREDUCE-3003
Updating MAPREDUCE-3032
Updating MAPREDUCE-3068
Updating MAPREDUCE-3197
Updating HDFS-2188
Updating MAPREDUCE-3196
Email was triggered for: Failure
Sending email for trigger: Failure



###################################################################################
############################## FAILED TESTS (if any) ##############################
No tests ran.

Mime
View raw message