hadoop-mapreduce-dev mailing list archives

Site index · List index
Message view « Date » · « Thread »
Top « Date » · « Thread »
From Apache Jenkins Server <jenk...@builds.apache.org>
Subject Hadoop-Mapreduce-trunk - Build # 858 - Failure
Date Wed, 12 Oct 2011 13:19:47 GMT
See https://builds.apache.org/job/Hadoop-Mapreduce-trunk/858/

###################################################################################
########################## LAST 60 LINES OF THE CONSOLE ###########################
[...truncated 20036 lines...]
[INFO] 
[INFO] hadoop-yarn-api ................................... SUCCESS [13.214s]
[INFO] hadoop-yarn-common ................................ SUCCESS [11.040s]
[INFO] hadoop-yarn-server-common ......................... SUCCESS [10.863s]
[INFO] hadoop-yarn-server-nodemanager .................... SUCCESS [31.711s]
[INFO] hadoop-yarn-server-resourcemanager ................ SUCCESS [50.489s]
[INFO] hadoop-yarn-server-tests .......................... SUCCESS [9.765s]
[INFO] hadoop-yarn-server ................................ SUCCESS [4.537s]
[INFO] hadoop-yarn-applications-distributedshell ......... SUCCESS [16.690s]
[INFO] hadoop-yarn-applications .......................... SUCCESS [2.951s]
[INFO] hadoop-yarn-site .................................. SUCCESS [3.255s]
[INFO] hadoop-yarn ....................................... SUCCESS [5.950s]
[INFO] hadoop-mapreduce-client-core ...................... SUCCESS [8.094s]
[INFO] hadoop-mapreduce-client-common .................... SUCCESS [8.285s]
[INFO] hadoop-mapreduce-client-shuffle ................... SUCCESS [3.223s]
[INFO] hadoop-mapreduce-client-app ....................... FAILURE [7.980s]
[INFO] hadoop-mapreduce-client-hs ........................ SKIPPED
[INFO] hadoop-mapreduce-client-jobclient ................. SKIPPED
[INFO] hadoop-mapreduce-client ........................... SKIPPED
[INFO] hadoop-mapreduce .................................. SKIPPED
[INFO] ------------------------------------------------------------------------
[INFO] BUILD FAILURE
[INFO] ------------------------------------------------------------------------
[INFO] Total time: 3:08.479s
[INFO] Finished at: Wed Oct 12 13:17:46 UTC 2011
[INFO] Final Memory: 63M/749M
[INFO] ------------------------------------------------------------------------
[ERROR] Failed to execute goal org.apache.maven.plugins:maven-surefire-plugin:2.7.2:test (default-test)
on project hadoop-mapreduce-client-app: There are test failures.
[ERROR] 
[ERROR] Please refer to /home/jenkins/jenkins-slave/workspace/Hadoop-Mapreduce-trunk/trunk/hadoop-mapreduce-project/hadoop-mapreduce-client/hadoop-mapreduce-client-app/target/surefire-reports
for the individual test results.
[ERROR] -> [Help 1]
[ERROR] 
[ERROR] To see the full stack trace of the errors, re-run Maven with the -e switch.
[ERROR] Re-run Maven using the -X switch to enable full debug logging.
[ERROR] 
[ERROR] For more information about the errors and possible solutions, please read the following
articles:
[ERROR] [Help 1] http://cwiki.apache.org/confluence/display/MAVEN/MojoFailureException
[ERROR] 
[ERROR] After correcting the problems, you can resume the build with the command
[ERROR]   mvn <goals> -rf :hadoop-mapreduce-client-app
Build step 'Execute shell' marked build as failure
[FINDBUGS] Skipping publisher since build result is FAILURE
Archiving artifacts
Updating MAPREDUCE-3166
Updating MAPREDUCE-3157
Updating MAPREDUCE-3148
Updating MAPREDUCE-3020
Updating HDFS-2422
Updating MAPREDUCE-3140
Updating HDFS-2349
Updating HADOOP-7736
Updating MAPREDUCE-3126
Updating MAPREDUCE-3125
Updating HADOOP-7642
Updating HADOOP-6490
Updating MAPREDUCE-2702
Updating MAPREDUCE-2668
Email was triggered for: Failure
Sending email for trigger: Failure



###################################################################################
############################## FAILED TESTS (if any) ##############################
No tests ran.

Mime
View raw message