hadoop-mapreduce-dev mailing list archives

Site index · List index
Message view « Date » · « Thread »
Top « Date » · « Thread »
From Apache Jenkins Server <jenk...@builds.apache.org>
Subject Hadoop-Mapreduce-0.23-Commit - Build # 60 - Still Failing
Date Wed, 26 Oct 2011 22:35:18 GMT
See https://builds.apache.org/job/Hadoop-Mapreduce-0.23-Commit/60/

###################################################################################
########################## LAST 60 LINES OF THE CONSOLE ###########################
[...truncated 14614 lines...]
    [junit] Running org.apache.hadoop.mapred.TestRackAwareTaskPlacement
    [junit] Tests run: 1, Failures: 0, Errors: 0, Time elapsed: 1.532 sec
    [junit] Running org.apache.hadoop.mapred.TestReduceFetchFromPartialMem
    [junit] Tests run: 1, Failures: 0, Errors: 0, Time elapsed: 30.373 sec
    [junit] Running org.apache.hadoop.mapred.TestReduceTask
    [junit] Tests run: 2, Failures: 0, Errors: 0, Time elapsed: 0.644 sec
    [junit] Running org.apache.hadoop.mapred.TestSequenceFileAsBinaryInputFormat
    [junit] Tests run: 1, Failures: 0, Errors: 0, Time elapsed: 0.777 sec
    [junit] Running org.apache.hadoop.mapred.TestSequenceFileAsBinaryOutputFormat
    [junit] Tests run: 3, Failures: 0, Errors: 0, Time elapsed: 0.98 sec
    [junit] Running org.apache.hadoop.mapred.TestSequenceFileInputFormat
    [junit] Tests run: 1, Failures: 0, Errors: 0, Time elapsed: 6.993 sec
    [junit] Running org.apache.hadoop.mapred.TestSeveral
    [junit] Running org.apache.hadoop.mapred.TestSeveral
    [junit] Tests run: 1, Failures: 0, Errors: 1, Time elapsed: 0 sec
    [junit] Test org.apache.hadoop.mapred.TestSeveral FAILED (timeout)
    [junit] Running org.apache.hadoop.mapred.TestSpeculativeExecution
    [junit] Tests run: 5, Failures: 0, Errors: 0, Time elapsed: 4.727 sec
    [junit] Running org.apache.hadoop.mapred.TestTaskLimits
    [junit] Tests run: 3, Failures: 0, Errors: 0, Time elapsed: 3.918 sec
    [junit] Running org.apache.hadoop.mapred.TestTaskTrackerBlacklisting
    [junit] Tests run: 7, Failures: 0, Errors: 0, Time elapsed: 1.813 sec
    [junit] Running org.apache.hadoop.mapred.TestTextInputFormat
    [junit] Tests run: 8, Failures: 0, Errors: 0, Time elapsed: 47.364 sec
    [junit] Running org.apache.hadoop.mapred.TestTextOutputFormat
    [junit] Tests run: 2, Failures: 0, Errors: 0, Time elapsed: 0.19 sec
    [junit] Running org.apache.hadoop.mapred.TestTrackerBlacklistAcrossJobs
    [junit] Tests run: 1, Failures: 0, Errors: 0, Time elapsed: 41.945 sec
    [junit] Running org.apache.hadoop.mapreduce.TestCounters
    [junit] Tests run: 2, Failures: 0, Errors: 0, Time elapsed: 0.347 sec
    [junit] Running org.apache.hadoop.mapreduce.TestMapCollection
    [junit] Tests run: 11, Failures: 0, Errors: 0, Time elapsed: 21.488 sec
    [junit] Running org.apache.hadoop.mapreduce.TestMapReduceLocal
    [junit] Tests run: 1, Failures: 0, Errors: 0, Time elapsed: 27.441 sec
    [junit] Running org.apache.hadoop.mapreduce.lib.input.TestFileInputFormat
    [junit] Tests run: 2, Failures: 0, Errors: 0, Time elapsed: 0.98 sec
    [junit] Running org.apache.hadoop.mapreduce.lib.output.TestFileOutputCommitter
    [junit] Tests run: 3, Failures: 0, Errors: 0, Time elapsed: 0.64 sec

checkfailure:
    [touch] Creating /home/jenkins/jenkins-slave/workspace/Hadoop-Mapreduce-0.23-Commit/trunk/hadoop-mapreduce-project/build/test/testsfailed

BUILD FAILED
/home/jenkins/jenkins-slave/workspace/Hadoop-Mapreduce-0.23-Commit/trunk/hadoop-mapreduce-project/build.xml:792:
The following error occurred while executing this line:
/home/jenkins/jenkins-slave/workspace/Hadoop-Mapreduce-0.23-Commit/trunk/hadoop-mapreduce-project/build.xml:755:
The following error occurred while executing this line:
/home/jenkins/jenkins-slave/workspace/Hadoop-Mapreduce-0.23-Commit/trunk/hadoop-mapreduce-project/build.xml:816:
Tests failed!

Total time: 20 minutes 57 seconds
Build step 'Execute shell' marked build as failure
Recording test results
Updating HDFS-2453
Updating HADOOP-7721
Updating HDFS-2404
Updating HDFS-2441
Updating HDFS-2424
Updating HDFS-2428
Updating HDFS-2439
Email was triggered for: Failure
Sending email for trigger: Failure



###################################################################################
############################## FAILED TESTS (if any) ##############################
All tests passed

Mime
View raw message