hadoop-mapreduce-dev mailing list archives

Site index · List index
Message view « Date » · « Thread »
Top « Date » · « Thread »
From Apache Jenkins Server <jenk...@builds.apache.org>
Subject Hadoop-Mapreduce-0.23-Commit - Build # 62 - Still Failing
Date Wed, 26 Oct 2011 23:48:22 GMT
See https://builds.apache.org/job/Hadoop-Mapreduce-0.23-Commit/62/

###################################################################################
########################## LAST 60 LINES OF THE CONSOLE ###########################
[...truncated 14610 lines...]
    [junit] Tests run: 5, Failures: 0, Errors: 0, Time elapsed: 22.109 sec
    [junit] Running org.apache.hadoop.mapred.TestMiniMRDFSCaching
    [junit] Tests run: 1, Failures: 0, Errors: 0, Time elapsed: 32.847 sec
    [junit] Running org.apache.hadoop.mapred.TestQueueAclsForCurrentUser
    [junit] Tests run: 3, Failures: 0, Errors: 0, Time elapsed: 0.661 sec
    [junit] Running org.apache.hadoop.mapred.TestRackAwareTaskPlacement
    [junit] Tests run: 1, Failures: 0, Errors: 0, Time elapsed: 1.537 sec
    [junit] Running org.apache.hadoop.mapred.TestReduceFetchFromPartialMem
    [junit] Tests run: 1, Failures: 0, Errors: 0, Time elapsed: 30.196 sec
    [junit] Running org.apache.hadoop.mapred.TestReduceTask
    [junit] Tests run: 2, Failures: 0, Errors: 0, Time elapsed: 0.645 sec
    [junit] Running org.apache.hadoop.mapred.TestSequenceFileAsBinaryInputFormat
    [junit] Tests run: 1, Failures: 0, Errors: 0, Time elapsed: 0.776 sec
    [junit] Running org.apache.hadoop.mapred.TestSequenceFileAsBinaryOutputFormat
    [junit] Tests run: 3, Failures: 0, Errors: 0, Time elapsed: 0.974 sec
    [junit] Running org.apache.hadoop.mapred.TestSequenceFileInputFormat
    [junit] Tests run: 1, Failures: 0, Errors: 0, Time elapsed: 5.557 sec
    [junit] Running org.apache.hadoop.mapred.TestSeveral
    [junit] Running org.apache.hadoop.mapred.TestSeveral
    [junit] Tests run: 1, Failures: 0, Errors: 1, Time elapsed: 0 sec
    [junit] Test org.apache.hadoop.mapred.TestSeveral FAILED (timeout)
    [junit] Running org.apache.hadoop.mapred.TestSpeculativeExecution
    [junit] Tests run: 5, Failures: 0, Errors: 0, Time elapsed: 4.323 sec
    [junit] Running org.apache.hadoop.mapred.TestTaskLimits
    [junit] Tests run: 3, Failures: 0, Errors: 0, Time elapsed: 3.902 sec
    [junit] Running org.apache.hadoop.mapred.TestTaskTrackerBlacklisting
    [junit] Tests run: 7, Failures: 0, Errors: 0, Time elapsed: 1.799 sec
    [junit] Running org.apache.hadoop.mapred.TestTextInputFormat
    [junit] Tests run: 8, Failures: 0, Errors: 0, Time elapsed: 62.584 sec
    [junit] Running org.apache.hadoop.mapred.TestTextOutputFormat
    [junit] Tests run: 2, Failures: 0, Errors: 0, Time elapsed: 0.191 sec
    [junit] Running org.apache.hadoop.mapred.TestTrackerBlacklistAcrossJobs
    [junit] Tests run: 1, Failures: 0, Errors: 0, Time elapsed: 41.922 sec
    [junit] Running org.apache.hadoop.mapreduce.TestCounters
    [junit] Tests run: 2, Failures: 0, Errors: 0, Time elapsed: 0.348 sec
    [junit] Running org.apache.hadoop.mapreduce.TestMapCollection
    [junit] Tests run: 11, Failures: 0, Errors: 0, Time elapsed: 21.255 sec
    [junit] Running org.apache.hadoop.mapreduce.TestMapReduceLocal
    [junit] Tests run: 1, Failures: 0, Errors: 0, Time elapsed: 28.834 sec
    [junit] Running org.apache.hadoop.mapreduce.lib.input.TestFileInputFormat
    [junit] Tests run: 2, Failures: 0, Errors: 0, Time elapsed: 0.98 sec
    [junit] Running org.apache.hadoop.mapreduce.lib.output.TestFileOutputCommitter
    [junit] Tests run: 3, Failures: 0, Errors: 0, Time elapsed: 0.631 sec

checkfailure:
    [touch] Creating /home/jenkins/jenkins-slave/workspace/Hadoop-Mapreduce-0.23-Commit/trunk/hadoop-mapreduce-project/build/test/testsfailed

BUILD FAILED
/home/jenkins/jenkins-slave/workspace/Hadoop-Mapreduce-0.23-Commit/trunk/hadoop-mapreduce-project/build.xml:792:
The following error occurred while executing this line:
/home/jenkins/jenkins-slave/workspace/Hadoop-Mapreduce-0.23-Commit/trunk/hadoop-mapreduce-project/build.xml:755:
The following error occurred while executing this line:
/home/jenkins/jenkins-slave/workspace/Hadoop-Mapreduce-0.23-Commit/trunk/hadoop-mapreduce-project/build.xml:816:
Tests failed!

Total time: 21 minutes 16 seconds
Build step 'Execute shell' marked build as failure
Recording test results
Updating HDFS-2501
Updating HDFS-2494
Email was triggered for: Failure
Sending email for trigger: Failure



###################################################################################
############################## FAILED TESTS (if any) ##############################
All tests passed

Mime
View raw message