hadoop-mapreduce-dev mailing list archives

Site index · List index
Message view « Date » · « Thread »
Top « Date » · « Thread »
From Apache Jenkins Server <jenk...@builds.apache.org>
Subject Hadoop-Mapreduce-trunk-Commit - Build # 1049 - Still Failing
Date Fri, 07 Oct 2011 05:51:46 GMT
See https://builds.apache.org/job/Hadoop-Mapreduce-trunk-Commit/1049/

###################################################################################
########################## LAST 60 LINES OF THE CONSOLE ###########################
[...truncated 10725 lines...]
    [junit] Tests run: 3, Failures: 0, Errors: 0, Time elapsed: 3.811 sec
    [junit] Running org.apache.hadoop.mapred.TestMapRed
    [junit] Tests run: 5, Failures: 0, Errors: 0, Time elapsed: 22.262 sec
    [junit] Running org.apache.hadoop.mapred.TestMiniMRDFSCaching
    [junit] Tests run: 1, Failures: 0, Errors: 0, Time elapsed: 32.936 sec
    [junit] Running org.apache.hadoop.mapred.TestQueueAclsForCurrentUser
    [junit] Tests run: 3, Failures: 0, Errors: 0, Time elapsed: 0.583 sec
    [junit] Running org.apache.hadoop.mapred.TestRackAwareTaskPlacement
    [junit] Tests run: 1, Failures: 0, Errors: 0, Time elapsed: 1.528 sec
    [junit] Running org.apache.hadoop.mapred.TestReduceFetchFromPartialMem
    [junit] Tests run: 1, Failures: 0, Errors: 0, Time elapsed: 31.585 sec
    [junit] Running org.apache.hadoop.mapred.TestReduceTask
    [junit] Tests run: 2, Failures: 0, Errors: 0, Time elapsed: 0.615 sec
    [junit] Running org.apache.hadoop.mapred.TestSequenceFileAsBinaryInputFormat
    [junit] Tests run: 1, Failures: 0, Errors: 0, Time elapsed: 0.762 sec
    [junit] Running org.apache.hadoop.mapred.TestSequenceFileAsBinaryOutputFormat
    [junit] Tests run: 3, Failures: 0, Errors: 0, Time elapsed: 1.021 sec
    [junit] Running org.apache.hadoop.mapred.TestSequenceFileInputFormat
    [junit] Tests run: 1, Failures: 0, Errors: 0, Time elapsed: 5.282 sec
    [junit] Running org.apache.hadoop.mapred.TestSeveral
    [junit] Tests run: 3, Failures: 0, Errors: 0, Time elapsed: 43.212 sec
    [junit] Running org.apache.hadoop.mapred.TestSpeculativeExecution
    [junit] Tests run: 5, Failures: 0, Errors: 0, Time elapsed: 3.997 sec
    [junit] Running org.apache.hadoop.mapred.TestTaskLimits
    [junit] Tests run: 3, Failures: 0, Errors: 0, Time elapsed: 3.882 sec
    [junit] Running org.apache.hadoop.mapred.TestTaskTrackerBlacklisting
    [junit] Tests run: 7, Failures: 0, Errors: 0, Time elapsed: 1.742 sec
    [junit] Running org.apache.hadoop.mapred.TestTextInputFormat
    [junit] Tests run: 8, Failures: 0, Errors: 0, Time elapsed: 49.26 sec
    [junit] Running org.apache.hadoop.mapred.TestTextOutputFormat
    [junit] Tests run: 2, Failures: 0, Errors: 0, Time elapsed: 0.179 sec
    [junit] Running org.apache.hadoop.mapred.TestTrackerBlacklistAcrossJobs
    [junit] Tests run: 1, Failures: 0, Errors: 0, Time elapsed: 41.578 sec
    [junit] Running org.apache.hadoop.mapreduce.TestCounters
    [junit] Tests run: 2, Failures: 0, Errors: 0, Time elapsed: 0.347 sec
    [junit] Running org.apache.hadoop.mapreduce.TestMapCollection
    [junit] Tests run: 11, Failures: 0, Errors: 0, Time elapsed: 20.964 sec
    [junit] Running org.apache.hadoop.mapreduce.TestMapReduceLocal
    [junit] Tests run: 1, Failures: 0, Errors: 0, Time elapsed: 28.34 sec
    [junit] Running org.apache.hadoop.mapreduce.lib.input.TestFileInputFormat
    [junit] Tests run: 2, Failures: 0, Errors: 0, Time elapsed: 0.943 sec
    [junit] Running org.apache.hadoop.mapreduce.lib.output.TestFileOutputCommitter
    [junit] Tests run: 3, Failures: 1, Errors: 0, Time elapsed: 0.6 sec
    [junit] Test org.apache.hadoop.mapreduce.lib.output.TestFileOutputCommitter FAILED

checkfailure:
    [touch] Creating /home/jenkins/jenkins-slave/workspace/Hadoop-Mapreduce-trunk-Commit/trunk/hadoop-mapreduce-project/build/test/testsfailed

BUILD FAILED
/home/jenkins/jenkins-slave/workspace/Hadoop-Mapreduce-trunk-Commit/trunk/hadoop-mapreduce-project/build.xml:792:
The following error occurred while executing this line:
/home/jenkins/jenkins-slave/workspace/Hadoop-Mapreduce-trunk-Commit/trunk/hadoop-mapreduce-project/build.xml:755:
The following error occurred while executing this line:
/home/jenkins/jenkins-slave/workspace/Hadoop-Mapreduce-trunk-Commit/trunk/hadoop-mapreduce-project/build.xml:816:
Tests failed!

Total time: 8 minutes 6 seconds
Build step 'Execute shell' marked build as failure
Updating MAPREDUCE-2794
Recording test results
Email was triggered for: Failure
Sending email for trigger: Failure



###################################################################################
############################## FAILED TESTS (if any) ##############################
All tests passed

Mime
View raw message