hadoop-mapreduce-dev mailing list archives

Site index · List index
Message view « Date » · « Thread »
Top « Date » · « Thread »
From Apache Jenkins Server <jenk...@builds.apache.org>
Subject Hadoop-Mapreduce-trunk-Commit - Build # 1197 - Still Failing
Date Fri, 28 Oct 2011 00:07:40 GMT
See https://builds.apache.org/job/Hadoop-Mapreduce-trunk-Commit/1197/

###################################################################################
########################## LAST 60 LINES OF THE CONSOLE ###########################
[...truncated 9746 lines...]
    [unzip] Expanding: /home/jenkins/jenkins-slave/workspace/Hadoop-Mapreduce-trunk-Commit/trunk/hadoop-mapreduce-project/build/ivy/lib/Hadoop/common/hadoop-hdfs-0.24.0-SNAPSHOT.jar
into /home/jenkins/jenkins-slave/workspace/Hadoop-Mapreduce-trunk-Commit/trunk/hadoop-mapreduce-project/build

check-c++-configure:

create-c++-pipes-configure:
    [mkdir] Created dir: /home/jenkins/jenkins-slave/workspace/Hadoop-Mapreduce-trunk-Commit/trunk/hadoop-mapreduce-project/build/c++-build/Linux-i386-32/pipes
     [exec] checking for a BSD-compatible install... /usr/bin/install -c
     [exec] checking whether build environment is sane... yes
     [exec] checking for a thread-safe mkdir -p... /bin/mkdir -p
     [exec] checking for gawk... no
     [exec] checking for mawk... mawk
     [exec] checking whether make sets $(MAKE)... yes
     [exec] checking for style of include used by make... GNU
     [exec] checking for gcc... gcc
     [exec] checking whether the C compiler works... yes
     [exec] checking for C compiler default output file name... a.out
     [exec] checking for suffix of executables... 
     [exec] checking whether we are cross compiling... no
     [exec] checking for suffix of object files... o
     [exec] checking whether we are using the GNU C compiler... yes
     [exec] checking whether gcc accepts -g... yes
     [exec] checking for gcc option to accept ISO C89... none needed
     [exec] checking dependency style of gcc... gcc3
     [exec] checking how to run the C preprocessor... gcc -E
     [exec] checking for grep that handles long lines and -e... /bin/grep
     [exec] checking for egrep... /bin/grep -E
     [exec] checking for ANSI C header files... yes
     [exec] checking for sys/types.h... yes
     [exec] checking for sys/stat.h... yes
     [exec] checking for stdlib.h... yes
     [exec] checking for string.h... yes
     [exec] checking for memory.h... yes
     [exec] checking for strings.h... yes
     [exec] checking for inttypes.h... yes
     [exec] checking for stdint.h... yes
     [exec] checking for unistd.h... yes
     [exec] checking minix/config.h usability... no
     [exec] checking minix/config.h presence... no
     [exec] checking for minix/config.h... no
     [exec] checking whether it is safe to define __EXTENSIONS__... yes
     [exec] checking for special C compiler options needed for large files... no
     [exec] checking for _FILE_OFFSET_BITS value needed for large files... no
     [exec] checking pthread.h usability... yes
     [exec] checking pthread.h presence... yes
     [exec] checking for pthread.h... yes
     [exec] checking for pthread_create in -lpthread... yes
     [exec] checking for HMAC_Init in -lcrypto... no
     [exec] /home/jenkins/jenkins-slave/workspace/Hadoop-Mapreduce-trunk-Commit/trunk/hadoop-mapreduce-project/src/c++/pipes/configure:
line 266: return: please: numeric argument required
     [exec] configure: error: Cannot find libcrypto.so

BUILD FAILED
/home/jenkins/jenkins-slave/workspace/Hadoop-Mapreduce-trunk-Commit/trunk/hadoop-mapreduce-project/build.xml:1604:
exec returned: 255

Total time: 40 seconds
Build step 'Execute shell' marked build as failure
Recording test results
Updating HADOOP-7778
Email was triggered for: Failure
Sending email for trigger: Failure



###################################################################################
############################## FAILED TESTS (if any) ##############################
All tests passed

Mime
View raw message