hadoop-mapreduce-dev mailing list archives

Site index · List index
Message view « Date » · « Thread »
Top « Date » · « Thread »
From Apache Jenkins Server <jenk...@builds.apache.org>
Subject Hadoop-Mapreduce-0.23-Build - Build # 46 - Failure
Date Wed, 12 Oct 2011 13:10:24 GMT
See https://builds.apache.org/job/Hadoop-Mapreduce-0.23-Build/46/

###################################################################################
########################## LAST 60 LINES OF THE CONSOLE ###########################
[...truncated 10988 lines...]
[INFO] --- maven-surefire-plugin:2.7.2:test (default-test) @ hadoop-mapreduce-client-app ---
[INFO] Surefire report directory: /home/jenkins/jenkins-slave/workspace/Hadoop-Mapreduce-0.23-Build/trunk/hadoop-mapreduce-project/hadoop-mapreduce-client/hadoop-mapreduce-client-app/target/surefire-reports

-------------------------------------------------------
 T E S T S
-------------------------------------------------------
Running org.apache.hadoop.mapreduce.v2.app.TestMRClientService
[INFO] ------------------------------------------------------------------------
[INFO] Reactor Summary:
[INFO] 
[INFO] hadoop-yarn-api ................................... SUCCESS [9.524s]
[INFO] hadoop-yarn-common ................................ SUCCESS [6.976s]
[INFO] hadoop-yarn-server-common ......................... SUCCESS [7.264s]
[INFO] hadoop-yarn-server-nodemanager .................... SUCCESS [37.831s]
[INFO] hadoop-yarn-server-resourcemanager ................ SUCCESS [45.534s]
[INFO] hadoop-yarn-server-tests .......................... SUCCESS [6.550s]
[INFO] hadoop-yarn-server ................................ SUCCESS [0.070s]
[INFO] hadoop-yarn-applications-distributedshell ......... SUCCESS [13.680s]
[INFO] hadoop-yarn-applications .......................... SUCCESS [0.059s]
[INFO] hadoop-yarn-site .................................. SUCCESS [0.277s]
[INFO] hadoop-yarn ....................................... SUCCESS [0.059s]
[INFO] hadoop-mapreduce-client-core ...................... SUCCESS [2.882s]
[INFO] hadoop-mapreduce-client-common .................... SUCCESS [5.935s]
[INFO] hadoop-mapreduce-client-shuffle ................... SUCCESS [1.327s]
[INFO] hadoop-mapreduce-client-app ....................... FAILURE [3.913s]
[INFO] hadoop-mapreduce-client-hs ........................ SKIPPED
[INFO] hadoop-mapreduce-client-jobclient ................. SKIPPED
[INFO] hadoop-mapreduce-client ........................... SKIPPED
[INFO] hadoop-mapreduce .................................. SKIPPED
[INFO] ------------------------------------------------------------------------
[INFO] BUILD FAILURE
[INFO] ------------------------------------------------------------------------
[INFO] Total time: 2:22.299s
[INFO] Finished at: Wed Oct 12 13:08:35 UTC 2011
[INFO] Final Memory: 52M/248M
[INFO] ------------------------------------------------------------------------
[ERROR] Failed to execute goal org.apache.maven.plugins:maven-surefire-plugin:2.7.2:test (default-test)
on project hadoop-mapreduce-client-app: There are test failures.
[ERROR] 
[ERROR] Please refer to /home/jenkins/jenkins-slave/workspace/Hadoop-Mapreduce-0.23-Build/trunk/hadoop-mapreduce-project/hadoop-mapreduce-client/hadoop-mapreduce-client-app/target/surefire-reports
for the individual test results.
[ERROR] -> [Help 1]
[ERROR] 
[ERROR] To see the full stack trace of the errors, re-run Maven with the -e switch.
[ERROR] Re-run Maven using the -X switch to enable full debug logging.
[ERROR] 
[ERROR] For more information about the errors and possible solutions, please read the following
articles:
[ERROR] [Help 1] http://cwiki.apache.org/confluence/display/MAVEN/MojoFailureException
[ERROR] 
[ERROR] After correcting the problems, you can resume the build with the command
[ERROR]   mvn <goals> -rf :hadoop-mapreduce-client-app
Build step 'Execute shell' marked build as failure
Archiving artifacts
Updating MAPREDUCE-3020
Updating HDFS-2422
Updating MAPREDUCE-3140
Updating MAPREDUCE-2668
Updating MAPREDUCE-3126
Updating MAPREDUCE-3125
Email was triggered for: Failure
Sending email for trigger: Failure



###################################################################################
############################## FAILED TESTS (if any) ##############################
No tests ran.

Mime
View raw message