hadoop-mapreduce-dev mailing list archives

Site index · List index
Message view « Date » · « Thread »
Top « Date » · « Thread »
From Apache Jenkins Server <jenk...@builds.apache.org>
Subject Hadoop-Mapreduce-trunk-Commit - Build # 1182 - Still Failing
Date Thu, 27 Oct 2011 08:47:06 GMT
See https://builds.apache.org/job/Hadoop-Mapreduce-trunk-Commit/1182/

###################################################################################
########################## LAST 60 LINES OF THE CONSOLE ###########################
[...truncated 9737 lines...]
[ivy:resolve] ....................................................................................................................
(62kB)
[ivy:resolve] .. (0kB)
[ivy:resolve] 	[SUCCESSFUL ] commons-lang#commons-lang;1.0!commons-lang.jar (926ms)
[ivy:resolve] downloading http://repo1.maven.org/maven2/junit/junit/3.7/junit-3.7.jar ...
[ivy:resolve] .....................................................................................................................................................................................................................
(114kB)
[ivy:resolve] .. (0kB)
[ivy:resolve] 	[SUCCESSFUL ] junit#junit;3.7!junit.jar (1054ms)

ivy-retrieve-checkstyle:
[ivy:cachepath] DEPRECATED: 'ivy.conf.file' is deprecated, use 'ivy.settings.file' instead
[ivy:cachepath] :: loading settings :: file = /home/jenkins/jenkins-slave/workspace/Hadoop-Mapreduce-trunk-Commit/trunk/hadoop-mapreduce-project/ivy/ivysettings.xml

check-for-checkstyle:

checkstyle:
[checkstyle] Running Checkstyle 4.2 on 71 files
     [xslt] Processing /home/jenkins/jenkins-slave/workspace/Hadoop-Mapreduce-trunk-Commit/trunk/hadoop-mapreduce-project/build/test/checkstyle-errors.xml
to /home/jenkins/jenkins-slave/workspace/Hadoop-Mapreduce-trunk-Commit/trunk/hadoop-mapreduce-project/build/test/checkstyle-errors.html
     [xslt] Loading stylesheet /home/jenkins/jenkins-slave/workspace/Hadoop-Mapreduce-trunk-Commit/trunk/hadoop-mapreduce-project/src/test/checkstyle-noframes-sorted.xsl

ivy-download:
      [get] Getting: http://repo2.maven.org/maven2/org/apache/ivy/ivy/2.2.0/ivy-2.2.0.jar
      [get] To: /home/jenkins/jenkins-slave/workspace/Hadoop-Mapreduce-trunk-Commit/trunk/hadoop-mapreduce-project/ivy/ivy-2.2.0.jar
      [get] Not modified - so not downloaded

ivy-init-dirs:

ivy-probe-antlib:

ivy-init-antlib:

ivy-init:

ivy-resolve-common:

ivy-retrieve-common:

ivy-resolve-mapred:

ivy-retrieve-mapred:

init:
    [touch] Creating /tmp/null1131273885
   [delete] Deleting: /tmp/null1131273885
    [unzip] Expanding: /home/jenkins/jenkins-slave/workspace/Hadoop-Mapreduce-trunk-Commit/trunk/hadoop-mapreduce-project/build/ivy/lib/Hadoop/common/hadoop-hdfs-0.24.0-SNAPSHOT.jar
into /home/jenkins/jenkins-slave/workspace/Hadoop-Mapreduce-trunk-Commit/trunk/hadoop-mapreduce-project/build

check-c++-configure:

create-c++-utils-configure:

BUILD FAILED
/home/jenkins/jenkins-slave/workspace/Hadoop-Mapreduce-trunk-Commit/trunk/hadoop-mapreduce-project/build.xml:1849:
Execute failed: java.io.IOException: Cannot run program "autoreconf" (in directory "/home/jenkins/jenkins-slave/workspace/Hadoop-Mapreduce-trunk-Commit/trunk/hadoop-mapreduce-project/src/c++/utils"):
java.io.IOException: error=2, No such file or directory

Total time: 31 seconds
Build step 'Execute shell' marked build as failure
Recording test results
Updating MAPREDUCE-3259
Updating MAPREDUCE-3279
Email was triggered for: Failure
Sending email for trigger: Failure



###################################################################################
############################## FAILED TESTS (if any) ##############################
All tests passed

Mime
View raw message