hadoop-mapreduce-dev mailing list archives

Site index · List index
Message view « Date » · « Thread »
Top « Date » · « Thread »
From Apache Jenkins Server <jenk...@builds.apache.org>
Subject Hadoop-Mapreduce-trunk-Commit - Build # 1051 - Still Failing
Date Fri, 07 Oct 2011 12:02:01 GMT
See https://builds.apache.org/job/Hadoop-Mapreduce-trunk-Commit/1051/

###################################################################################
########################## LAST 60 LINES OF THE CONSOLE ###########################
[...truncated 10725 lines...]
    [junit] Tests run: 3, Failures: 0, Errors: 0, Time elapsed: 3.811 sec
    [junit] Running org.apache.hadoop.mapred.TestMapRed
    [junit] Tests run: 5, Failures: 0, Errors: 0, Time elapsed: 21.978 sec
    [junit] Running org.apache.hadoop.mapred.TestMiniMRDFSCaching
    [junit] Tests run: 1, Failures: 0, Errors: 0, Time elapsed: 29.908 sec
    [junit] Running org.apache.hadoop.mapred.TestQueueAclsForCurrentUser
    [junit] Tests run: 3, Failures: 0, Errors: 0, Time elapsed: 0.583 sec
    [junit] Running org.apache.hadoop.mapred.TestRackAwareTaskPlacement
    [junit] Tests run: 1, Failures: 0, Errors: 0, Time elapsed: 1.483 sec
    [junit] Running org.apache.hadoop.mapred.TestReduceFetchFromPartialMem
    [junit] Tests run: 1, Failures: 0, Errors: 0, Time elapsed: 31.69 sec
    [junit] Running org.apache.hadoop.mapred.TestReduceTask
    [junit] Tests run: 2, Failures: 0, Errors: 0, Time elapsed: 0.611 sec
    [junit] Running org.apache.hadoop.mapred.TestSequenceFileAsBinaryInputFormat
    [junit] Tests run: 1, Failures: 0, Errors: 0, Time elapsed: 0.753 sec
    [junit] Running org.apache.hadoop.mapred.TestSequenceFileAsBinaryOutputFormat
    [junit] Tests run: 3, Failures: 0, Errors: 0, Time elapsed: 1.037 sec
    [junit] Running org.apache.hadoop.mapred.TestSequenceFileInputFormat
    [junit] Tests run: 1, Failures: 0, Errors: 0, Time elapsed: 6.715 sec
    [junit] Running org.apache.hadoop.mapred.TestSeveral
    [junit] Tests run: 3, Failures: 0, Errors: 0, Time elapsed: 42.854 sec
    [junit] Running org.apache.hadoop.mapred.TestSpeculativeExecution
    [junit] Tests run: 5, Failures: 0, Errors: 0, Time elapsed: 4.014 sec
    [junit] Running org.apache.hadoop.mapred.TestTaskLimits
    [junit] Tests run: 3, Failures: 0, Errors: 0, Time elapsed: 3.887 sec
    [junit] Running org.apache.hadoop.mapred.TestTaskTrackerBlacklisting
    [junit] Tests run: 7, Failures: 0, Errors: 0, Time elapsed: 1.693 sec
    [junit] Running org.apache.hadoop.mapred.TestTextInputFormat
    [junit] Tests run: 8, Failures: 0, Errors: 0, Time elapsed: 49.553 sec
    [junit] Running org.apache.hadoop.mapred.TestTextOutputFormat
    [junit] Tests run: 2, Failures: 0, Errors: 0, Time elapsed: 0.178 sec
    [junit] Running org.apache.hadoop.mapred.TestTrackerBlacklistAcrossJobs
    [junit] Tests run: 1, Failures: 0, Errors: 0, Time elapsed: 47.205 sec
    [junit] Running org.apache.hadoop.mapreduce.TestCounters
    [junit] Tests run: 2, Failures: 0, Errors: 0, Time elapsed: 0.349 sec
    [junit] Running org.apache.hadoop.mapreduce.TestMapCollection
    [junit] Tests run: 11, Failures: 0, Errors: 0, Time elapsed: 21.243 sec
    [junit] Running org.apache.hadoop.mapreduce.TestMapReduceLocal
    [junit] Tests run: 1, Failures: 0, Errors: 0, Time elapsed: 28.377 sec
    [junit] Running org.apache.hadoop.mapreduce.lib.input.TestFileInputFormat
    [junit] Tests run: 2, Failures: 0, Errors: 0, Time elapsed: 0.946 sec
    [junit] Running org.apache.hadoop.mapreduce.lib.output.TestFileOutputCommitter
    [junit] Tests run: 3, Failures: 1, Errors: 0, Time elapsed: 0.597 sec
    [junit] Test org.apache.hadoop.mapreduce.lib.output.TestFileOutputCommitter FAILED

checkfailure:
    [touch] Creating /home/jenkins/jenkins-slave/workspace/Hadoop-Mapreduce-trunk-Commit/trunk/hadoop-mapreduce-project/build/test/testsfailed

BUILD FAILED
/home/jenkins/jenkins-slave/workspace/Hadoop-Mapreduce-trunk-Commit/trunk/hadoop-mapreduce-project/build.xml:792:
The following error occurred while executing this line:
/home/jenkins/jenkins-slave/workspace/Hadoop-Mapreduce-trunk-Commit/trunk/hadoop-mapreduce-project/build.xml:755:
The following error occurred while executing this line:
/home/jenkins/jenkins-slave/workspace/Hadoop-Mapreduce-trunk-Commit/trunk/hadoop-mapreduce-project/build.xml:816:
Tests failed!

Total time: 8 minutes 16 seconds
Build step 'Execute shell' marked build as failure
Updating MAPREDUCE-3141
Recording test results
Email was triggered for: Failure
Sending email for trigger: Failure



###################################################################################
############################## FAILED TESTS (if any) ##############################
All tests passed

Mime
View raw message