hadoop-mapreduce-dev mailing list archives

Site index · List index
Message view « Date » · « Thread »
Top « Date » · « Thread »
From Apache Jenkins Server <jenk...@builds.apache.org>
Subject Hadoop-Mapreduce-trunk - Build # 873 - Failure
Date Thu, 27 Oct 2011 13:04:15 GMT
See https://builds.apache.org/job/Hadoop-Mapreduce-trunk/873/

###################################################################################
########################## LAST 60 LINES OF THE CONSOLE ###########################
[...truncated 6680 lines...]

check-c++-configure:

create-c++-utils-configure:

BUILD FAILED
/home/jenkins/jenkins-slave/workspace/Hadoop-Mapreduce-trunk/trunk/hadoop-mapreduce-project/build.xml:1849:
Execute failed: java.io.IOException: Cannot run program "autoreconf" (in directory "/home/jenkins/jenkins-slave/workspace/Hadoop-Mapreduce-trunk/trunk/hadoop-mapreduce-project/src/c++/utils"):
java.io.IOException: error=2, No such file or directory

Total time: 1 minute 53 seconds
+ gunzip /home/jenkins/jenkins-slave/workspace/Hadoop-Mapreduce-trunk/trunk/hadoop-mapreduce-project/target/hadoop-mapreduce-0.24.0-SNAPSHOT-all.tar.gz
gzip: /home/jenkins/jenkins-slave/workspace/Hadoop-Mapreduce-trunk/trunk/hadoop-mapreduce-project/target/hadoop-mapreduce-0.24.0-SNAPSHOT-all.tar.gz:
No such file or directory
+ cd /home/jenkins/jenkins-slave/workspace/Hadoop-Mapreduce-trunk/trunk/hadoop-mapreduce-project/build/contrib/
/tmp/hudson583894872570885850.sh: line 13: cd: /home/jenkins/jenkins-slave/workspace/Hadoop-Mapreduce-trunk/trunk/hadoop-mapreduce-project/build/contrib/:
No such file or directory
+ tar -rvf /home/jenkins/jenkins-slave/workspace/Hadoop-Mapreduce-trunk/trunk/hadoop-mapreduce-project/target/hadoop-mapreduce-0.24.0-SNAPSHOT-all.tar
gridmix/hadoop-0.24.0-SNAPSHOT-gridmix.jar
tar: /home/jenkins/jenkins-slave/workspace/Hadoop-Mapreduce-trunk/trunk/hadoop-mapreduce-project/target/hadoop-mapreduce-0.24.0-SNAPSHOT-all.tar:
Cannot read: Bad file descriptor
tar: At beginning of tape, quitting now
tar: Error is not recoverable: exiting now
+ tar -rvf /home/jenkins/jenkins-slave/workspace/Hadoop-Mapreduce-trunk/trunk/hadoop-mapreduce-project/target/hadoop-mapreduce-0.24.0-SNAPSHOT-all.tar
streaming/hadoop-0.24.0-SNAPSHOT-streaming.jar
tar: /home/jenkins/jenkins-slave/workspace/Hadoop-Mapreduce-trunk/trunk/hadoop-mapreduce-project/target/hadoop-mapreduce-0.24.0-SNAPSHOT-all.tar:
Cannot read: Bad file descriptor
tar: At beginning of tape, quitting now
tar: Error is not recoverable: exiting now
+ cd /home/jenkins/jenkins-slave/workspace/Hadoop-Mapreduce-trunk/trunk/hadoop-mapreduce-project
+ tar -rvf /home/jenkins/jenkins-slave/workspace/Hadoop-Mapreduce-trunk/trunk/hadoop-mapreduce-project/target/hadoop-mapreduce-0.24.0-SNAPSHOT-all.tar
build/hadoop-mapreduce-tools-0.24.0-SNAPSHOT.jar
tar: /home/jenkins/jenkins-slave/workspace/Hadoop-Mapreduce-trunk/trunk/hadoop-mapreduce-project/target/hadoop-mapreduce-0.24.0-SNAPSHOT-all.tar:
Cannot read: Bad file descriptor
tar: At beginning of tape, quitting now
tar: Error is not recoverable: exiting now
+ tar -rvf /home/jenkins/jenkins-slave/workspace/Hadoop-Mapreduce-trunk/trunk/hadoop-mapreduce-project/target/hadoop-mapreduce-0.24.0-SNAPSHOT-all.tar
build/hadoop-mapreduce-examples-0.24.0-SNAPSHOT.jar
tar: /home/jenkins/jenkins-slave/workspace/Hadoop-Mapreduce-trunk/trunk/hadoop-mapreduce-project/target/hadoop-mapreduce-0.24.0-SNAPSHOT-all.tar:
Cannot read: Bad file descriptor
tar: At beginning of tape, quitting now
tar: Error is not recoverable: exiting now
+ tar -rvf /home/jenkins/jenkins-slave/workspace/Hadoop-Mapreduce-trunk/trunk/hadoop-mapreduce-project/target/hadoop-mapreduce-0.24.0-SNAPSHOT-all.tar
build/hadoop-mapreduce-test-0.24.0-SNAPSHOT.jar
tar: /home/jenkins/jenkins-slave/workspace/Hadoop-Mapreduce-trunk/trunk/hadoop-mapreduce-project/target/hadoop-mapreduce-0.24.0-SNAPSHOT-all.tar:
Cannot read: Bad file descriptor
tar: At beginning of tape, quitting now
tar: Error is not recoverable: exiting now
+ gzip /home/jenkins/jenkins-slave/workspace/Hadoop-Mapreduce-trunk/trunk/hadoop-mapreduce-project/target/hadoop-mapreduce-0.24.0-SNAPSHOT-all.tar
gzip: /home/jenkins/jenkins-slave/workspace/Hadoop-Mapreduce-trunk/trunk/hadoop-mapreduce-project/target/hadoop-mapreduce-0.24.0-SNAPSHOT-all.tar:
No such file or directory
+ /home/jenkins/tools/maven/latest/bin/mvn install
/tmp/hudson583894872570885850.sh: line 22: /home/jenkins/tools/maven/latest/bin/mvn: No such
file or directory
Build step 'Execute shell' marked build as failure
[FINDBUGS] Skipping publisher since build result is FAILURE
Archiving artifacts
Updating MAPREDUCE-3205
Updating HDFS-2411
Updating MAPREDUCE-2986
Updating MAPREDUCE-3175
Updating HADOOP-7766
Updating HDFS-1869
Updating HADOOP-7768
Updating MAPREDUCE-3259
Updating HADOOP-7764
Updating MAPREDUCE-3257
Updating HDFS-2494
Updating MAPREDUCE-3264
Updating MAPREDUCE-3240
Updating HADOOP-7761
Updating MAPREDUCE-3254
Updating MAPREDUCE-3279
Email was triggered for: Failure
Sending email for trigger: Failure



###################################################################################
############################## FAILED TESTS (if any) ##############################
No tests ran.

Mime
View raw message