hadoop-mapreduce-dev mailing list archives

Site index · List index
Message view « Date » · « Thread »
Top « Date » · « Thread »
From Apache Jenkins Server <jenk...@builds.apache.org>
Subject Hadoop-Mapreduce-22-branch - Build # 78 - Still Failing
Date Fri, 30 Sep 2011 03:04:20 GMT
See https://builds.apache.org/job/Hadoop-Mapreduce-22-branch/78/

###################################################################################
########################## LAST 60 LINES OF THE CONSOLE ###########################
[...truncated 194464 lines...]
     [exec] libtool: install: /usr/bin/install -c pipes-sort /home/jenkins/jenkins-slave/workspace/Hadoop-Mapreduce-22-branch/trunk/build/c++-examples/Linux-i386-32/bin/pipes-sort
     [exec] make[1]: Nothing to be done for `install-data-am'.
     [exec] make[1]: Leaving directory `/home/jenkins/jenkins-slave/workspace/Hadoop-Mapreduce-22-branch/trunk/build/c++-build/Linux-i386-32/examples/pipes'

compile-c++-examples:

compile-examples:

ivy-resolve-test:

ivy-retrieve-test:

compile-mapred-test:
    [javac] Compiling 8 source files to /home/jenkins/jenkins-slave/workspace/Hadoop-Mapreduce-22-branch/trunk/build/test/mapred/testjar
    [javac] Note: Some input files use or override a deprecated API.
    [javac] Note: Recompile with -Xlint:deprecation for details.
   [delete] Deleting: /home/jenkins/jenkins-slave/workspace/Hadoop-Mapreduce-22-branch/trunk/build/test/mapred/testjar/testjob.jar
      [jar] Building jar: /home/jenkins/jenkins-slave/workspace/Hadoop-Mapreduce-22-branch/trunk/build/test/mapred/testjar/testjob.jar
    [javac] Compiling 1 source file to /home/jenkins/jenkins-slave/workspace/Hadoop-Mapreduce-22-branch/trunk/build/test/mapred/testshell
    [javac] Note: /home/jenkins/jenkins-slave/workspace/Hadoop-Mapreduce-22-branch/trunk/src/test/mapred/testshell/ExternalMapReduce.java
uses or overrides a deprecated API.
    [javac] Note: Recompile with -Xlint:deprecation for details.
   [delete] Deleting: /home/jenkins/jenkins-slave/workspace/Hadoop-Mapreduce-22-branch/trunk/build/test/mapred/testshell/testshell.jar
      [jar] Building jar: /home/jenkins/jenkins-slave/workspace/Hadoop-Mapreduce-22-branch/trunk/build/test/mapred/testshell/testshell.jar
   [delete] Deleting directory /home/jenkins/jenkins-slave/workspace/Hadoop-Mapreduce-22-branch/trunk/build/test/cache
    [mkdir] Created dir: /home/jenkins/jenkins-slave/workspace/Hadoop-Mapreduce-22-branch/trunk/build/test/cache
   [delete] Deleting directory /home/jenkins/jenkins-slave/workspace/Hadoop-Mapreduce-22-branch/trunk/build/test/debug
    [mkdir] Created dir: /home/jenkins/jenkins-slave/workspace/Hadoop-Mapreduce-22-branch/trunk/build/test/debug
     [copy] Copying 1 file to /home/jenkins/jenkins-slave/workspace/Hadoop-Mapreduce-22-branch/trunk/build/test/debug
     [copy] Copying 1 file to /home/jenkins/jenkins-slave/workspace/Hadoop-Mapreduce-22-branch/trunk/build/test/cache
     [copy] Copying 1 file to /home/jenkins/jenkins-slave/workspace/Hadoop-Mapreduce-22-branch/trunk/build/test/cache
     [copy] Copying 1 file to /home/jenkins/jenkins-slave/workspace/Hadoop-Mapreduce-22-branch/trunk/build/test/cache
     [copy] Copying 1 file to /home/jenkins/jenkins-slave/workspace/Hadoop-Mapreduce-22-branch/trunk/build/test/cache
     [copy] Copying 1 file to /home/jenkins/jenkins-slave/workspace/Hadoop-Mapreduce-22-branch/trunk/build/test/cache
     [copy] Copying 1 file to /home/jenkins/jenkins-slave/workspace/Hadoop-Mapreduce-22-branch/trunk/build/test/cache
     [copy] Copying 1 file to /home/jenkins/jenkins-slave/workspace/Hadoop-Mapreduce-22-branch/trunk/build/test/cache
     [copy] Copying 1 file to /home/jenkins/jenkins-slave/workspace/Hadoop-Mapreduce-22-branch/trunk/build/test/cache

test-contrib:

test:

BUILD FAILED
/home/jenkins/jenkins-slave/workspace/Hadoop-Mapreduce-22-branch/trunk/build.xml:814: The
following error occurred while executing this line:
/home/jenkins/jenkins-slave/workspace/Hadoop-Mapreduce-22-branch/trunk/build.xml:793: The
following error occurred while executing this line:
/home/jenkins/jenkins-slave/workspace/Hadoop-Mapreduce-22-branch/trunk/src/contrib/build.xml:87:
The following error occurred while executing this line:
/home/jenkins/jenkins-slave/workspace/Hadoop-Mapreduce-22-branch/trunk/src/contrib/streaming/build.xml:26:
The following error occurred while executing this line:
/home/jenkins/jenkins-slave/workspace/Hadoop-Mapreduce-22-branch/trunk/src/contrib/build-contrib.xml:82:
Source resource does not exist: /home/jenkins/jenkins-slave/workspace/Hadoop-Mapreduce-22-branch/trunk/src/contrib/ivy/libraries.properties

Total time: 134 minutes 58 seconds
Build step 'Execute shell' marked build as failure
[FINDBUGS] Skipping publisher since build result is FAILURE
Archiving artifacts
Publishing Clover coverage report...
No Clover report will be published due to a Build Failure
Recording test results
Publishing Javadoc
Recording fingerprints
Email was triggered for: Failure
Sending email for trigger: Failure



###################################################################################
############################## FAILED TESTS (if any) ##############################
All tests passed

Mime
View raw message