hadoop-mapreduce-dev mailing list archives

Site index · List index
Message view « Date » · « Thread »
Top « Date » · « Thread »
From Apache Jenkins Server <jenk...@builds.apache.org>
Subject Hadoop-Mapreduce-trunk - Build # 805 - Still Failing
Date Sat, 03 Sep 2011 13:05:46 GMT
See https://builds.apache.org/job/Hadoop-Mapreduce-trunk/805/

###################################################################################
########################## LAST 60 LINES OF THE CONSOLE ###########################
[...truncated 9400 lines...]
[ivy:resolve] 	  https://repository.apache.org/content/repositories/snapshots/com/sun/jersey/jersey-json/working@asf001.sp2.ygridcore.net/jersey-json-working@asf001.sp2.ygridcore.net.pom
[ivy:resolve] 	  -- artifact com.sun.jersey#jersey-json;working@asf001.sp2.ygridcore.net!jersey-json.jar:
[ivy:resolve] 	  https://repository.apache.org/content/repositories/snapshots/com/sun/jersey/jersey-json/working@asf001.sp2.ygridcore.net/jersey-json-working@asf001.sp2.ygridcore.net.jar
[ivy:resolve] 	==== maven2: tried
[ivy:resolve] 	  http://repo1.maven.org/maven2/com/sun/jersey/jersey-json/working@asf001.sp2.ygridcore.net/jersey-json-working@asf001.sp2.ygridcore.net.pom
[ivy:resolve] 	  -- artifact com.sun.jersey#jersey-json;working@asf001.sp2.ygridcore.net!jersey-json.jar:
[ivy:resolve] 	  http://repo1.maven.org/maven2/com/sun/jersey/jersey-json/working@asf001.sp2.ygridcore.net/jersey-json-working@asf001.sp2.ygridcore.net.jar
[ivy:resolve] 		module not found: com.sun.jersey#jersey-server;working@asf001.sp2.ygridcore.net
[ivy:resolve] 	==== fs: tried
[ivy:resolve] 	  /home/jenkins/.m2/repository/com/sun/jersey/jersey-server/working@asf001.sp2.ygridcore.net/jersey-server-working@asf001.sp2.ygridcore.net.pom
[ivy:resolve] 	  -- artifact com.sun.jersey#jersey-server;working@asf001.sp2.ygridcore.net!jersey-server.jar:
[ivy:resolve] 	  /home/jenkins/.m2/repository/com/sun/jersey/jersey-server/working@asf001.sp2.ygridcore.net/jersey-server-working@asf001.sp2.ygridcore.net.jar
[ivy:resolve] 	==== apache-snapshot: tried
[ivy:resolve] 	  https://repository.apache.org/content/repositories/snapshots/com/sun/jersey/jersey-server/working@asf001.sp2.ygridcore.net/jersey-server-working@asf001.sp2.ygridcore.net.pom
[ivy:resolve] 	  -- artifact com.sun.jersey#jersey-server;working@asf001.sp2.ygridcore.net!jersey-server.jar:
[ivy:resolve] 	  https://repository.apache.org/content/repositories/snapshots/com/sun/jersey/jersey-server/working@asf001.sp2.ygridcore.net/jersey-server-working@asf001.sp2.ygridcore.net.jar
[ivy:resolve] 	==== maven2: tried
[ivy:resolve] 	  http://repo1.maven.org/maven2/com/sun/jersey/jersey-server/working@asf001.sp2.ygridcore.net/jersey-server-working@asf001.sp2.ygridcore.net.pom
[ivy:resolve] 	  -- artifact com.sun.jersey#jersey-server;working@asf001.sp2.ygridcore.net!jersey-server.jar:
[ivy:resolve] 	  http://repo1.maven.org/maven2/com/sun/jersey/jersey-server/working@asf001.sp2.ygridcore.net/jersey-server-working@asf001.sp2.ygridcore.net.jar
[ivy:resolve] 		module not found: org.apache.hadoop#hadoop-auth;working@asf001.sp2.ygridcore.net
[ivy:resolve] 	==== fs: tried
[ivy:resolve] 	  /home/jenkins/.m2/repository/org/apache/hadoop/hadoop-auth/working@asf001.sp2.ygridcore.net/hadoop-auth-working@asf001.sp2.ygridcore.net.pom
[ivy:resolve] 	  -- artifact org.apache.hadoop#hadoop-auth;working@asf001.sp2.ygridcore.net!hadoop-auth.jar:
[ivy:resolve] 	  /home/jenkins/.m2/repository/org/apache/hadoop/hadoop-auth/working@asf001.sp2.ygridcore.net/hadoop-auth-working@asf001.sp2.ygridcore.net.jar
[ivy:resolve] 	==== apache-snapshot: tried
[ivy:resolve] 	  https://repository.apache.org/content/repositories/snapshots/org/apache/hadoop/hadoop-auth/working@asf001.sp2.ygridcore.net/hadoop-auth-working@asf001.sp2.ygridcore.net.pom
[ivy:resolve] 	  -- artifact org.apache.hadoop#hadoop-auth;working@asf001.sp2.ygridcore.net!hadoop-auth.jar:
[ivy:resolve] 	  https://repository.apache.org/content/repositories/snapshots/org/apache/hadoop/hadoop-auth/working@asf001.sp2.ygridcore.net/hadoop-auth-working@asf001.sp2.ygridcore.net.jar
[ivy:resolve] 	==== maven2: tried
[ivy:resolve] 	  http://repo1.maven.org/maven2/org/apache/hadoop/hadoop-auth/working@asf001.sp2.ygridcore.net/hadoop-auth-working@asf001.sp2.ygridcore.net.pom
[ivy:resolve] 	  -- artifact org.apache.hadoop#hadoop-auth;working@asf001.sp2.ygridcore.net!hadoop-auth.jar:
[ivy:resolve] 	  http://repo1.maven.org/maven2/org/apache/hadoop/hadoop-auth/working@asf001.sp2.ygridcore.net/hadoop-auth-working@asf001.sp2.ygridcore.net.jar
[ivy:resolve] 		::::::::::::::::::::::::::::::::::::::::::::::
[ivy:resolve] 		::          UNRESOLVED DEPENDENCIES         ::
[ivy:resolve] 		::::::::::::::::::::::::::::::::::::::::::::::
[ivy:resolve] 		:: asm#asm;working@asf001.sp2.ygridcore.net: not found
[ivy:resolve] 		:: com.sun.jersey#jersey-core;working@asf001.sp2.ygridcore.net: not found
[ivy:resolve] 		:: com.sun.jersey#jersey-json;working@asf001.sp2.ygridcore.net: not found
[ivy:resolve] 		:: com.sun.jersey#jersey-server;working@asf001.sp2.ygridcore.net: not found
[ivy:resolve] 		:: org.apache.hadoop#hadoop-auth;working@asf001.sp2.ygridcore.net: not found
[ivy:resolve] 		::::::::::::::::::::::::::::::::::::::::::::::
[ivy:resolve] 
[ivy:resolve] :: USE VERBOSE OR DEBUG MESSAGE LEVEL FOR MORE DETAILS

BUILD FAILED
/home/jenkins/jenkins-slave/workspace/Hadoop-Mapreduce-trunk/trunk/hadoop-mapreduce-project/build.xml:2256:
impossible to resolve dependencies:
	resolve failed - see output for details

Total time: 9 seconds
Build step 'Execute shell' marked build as failure
[FINDBUGS] Skipping publisher since build result is FAILURE
Updating HDFS-2299
Updating MAPREDUCE-2716
Updating HADOOP-7524
Updating HADOOP-7606
Updating MAPREDUCE-2887
Email was triggered for: Failure
Sending email for trigger: Failure



###################################################################################
############################## FAILED TESTS (if any) ##############################
No tests ran.

Mime
View raw message