hadoop-mapreduce-dev mailing list archives

Site index · List index
Message view « Date » · « Thread »
Top « Date » · « Thread »
From Apache Jenkins Server <jenk...@builds.apache.org>
Subject Hadoop-Mapreduce-trunk - Build # 816 - Still Failing
Date Tue, 13 Sep 2011 01:03:45 GMT
See https://builds.apache.org/job/Hadoop-Mapreduce-trunk/816/

###################################################################################
########################## LAST 60 LINES OF THE CONSOLE ###########################
[...truncated 11609 lines...]
[ivy:resolve] 	  -- artifact org.apache.hadoop#hadoop-yarn-server-common;0.24.0-SNAPSHOT!hadoop-yarn-server-common.jar:
[ivy:resolve] 	  https://repository.apache.org/content/repositories/snapshots/org/apache/hadoop/hadoop-yarn-server-common/0.24.0-SNAPSHOT/hadoop-yarn-server-common-0.24.0-SNAPSHOT.jar
[ivy:resolve] 	==== maven2: tried
[ivy:resolve] 	  http://repo1.maven.org/maven2/org/apache/hadoop/hadoop-yarn-server-common/0.24.0-SNAPSHOT/hadoop-yarn-server-common-0.24.0-SNAPSHOT.pom
[ivy:resolve] 	  -- artifact org.apache.hadoop#hadoop-yarn-server-common;0.24.0-SNAPSHOT!hadoop-yarn-server-common.jar:
[ivy:resolve] 	  http://repo1.maven.org/maven2/org/apache/hadoop/hadoop-yarn-server-common/0.24.0-SNAPSHOT/hadoop-yarn-server-common-0.24.0-SNAPSHOT.jar
[ivy:resolve] 		module not found: org.apache.hadoop#hadoop-mapreduce-client-core;0.24.0-SNAPSHOT
[ivy:resolve] 	==== fs: tried
[ivy:resolve] 	  /home/jenkins/.m2/repository/org/apache/hadoop/hadoop-mapreduce-client-core/0.24.0-SNAPSHOT/hadoop-mapreduce-client-core-0.24.0-SNAPSHOT.pom
[ivy:resolve] 	  -- artifact org.apache.hadoop#hadoop-mapreduce-client-core;0.24.0-SNAPSHOT!hadoop-mapreduce-client-core.jar:
[ivy:resolve] 	  /home/jenkins/.m2/repository/org/apache/hadoop/hadoop-mapreduce-client-core/0.24.0-SNAPSHOT/hadoop-mapreduce-client-core-0.24.0-SNAPSHOT.jar
[ivy:resolve] 	==== apache-snapshot: tried
[ivy:resolve] 	  https://repository.apache.org/content/repositories/snapshots/org/apache/hadoop/hadoop-mapreduce-client-core/0.24.0-SNAPSHOT/hadoop-mapreduce-client-core-0.24.0-SNAPSHOT.pom
[ivy:resolve] 	  -- artifact org.apache.hadoop#hadoop-mapreduce-client-core;0.24.0-SNAPSHOT!hadoop-mapreduce-client-core.jar:
[ivy:resolve] 	  https://repository.apache.org/content/repositories/snapshots/org/apache/hadoop/hadoop-mapreduce-client-core/0.24.0-SNAPSHOT/hadoop-mapreduce-client-core-0.24.0-SNAPSHOT.jar
[ivy:resolve] 	==== maven2: tried
[ivy:resolve] 	  http://repo1.maven.org/maven2/org/apache/hadoop/hadoop-mapreduce-client-core/0.24.0-SNAPSHOT/hadoop-mapreduce-client-core-0.24.0-SNAPSHOT.pom
[ivy:resolve] 	  -- artifact org.apache.hadoop#hadoop-mapreduce-client-core;0.24.0-SNAPSHOT!hadoop-mapreduce-client-core.jar:
[ivy:resolve] 	  http://repo1.maven.org/maven2/org/apache/hadoop/hadoop-mapreduce-client-core/0.24.0-SNAPSHOT/hadoop-mapreduce-client-core-0.24.0-SNAPSHOT.jar
[ivy:resolve] 		module not found: org.apache.hadoop#hadoop-yarn-common;0.24.0-SNAPSHOT
[ivy:resolve] 	==== fs: tried
[ivy:resolve] 	  /home/jenkins/.m2/repository/org/apache/hadoop/hadoop-yarn-common/0.24.0-SNAPSHOT/hadoop-yarn-common-0.24.0-SNAPSHOT.pom
[ivy:resolve] 	  -- artifact org.apache.hadoop#hadoop-yarn-common;0.24.0-SNAPSHOT!hadoop-yarn-common.jar:
[ivy:resolve] 	  /home/jenkins/.m2/repository/org/apache/hadoop/hadoop-yarn-common/0.24.0-SNAPSHOT/hadoop-yarn-common-0.24.0-SNAPSHOT.jar
[ivy:resolve] 	==== apache-snapshot: tried
[ivy:resolve] 	  https://repository.apache.org/content/repositories/snapshots/org/apache/hadoop/hadoop-yarn-common/0.24.0-SNAPSHOT/hadoop-yarn-common-0.24.0-SNAPSHOT.pom
[ivy:resolve] 	  -- artifact org.apache.hadoop#hadoop-yarn-common;0.24.0-SNAPSHOT!hadoop-yarn-common.jar:
[ivy:resolve] 	  https://repository.apache.org/content/repositories/snapshots/org/apache/hadoop/hadoop-yarn-common/0.24.0-SNAPSHOT/hadoop-yarn-common-0.24.0-SNAPSHOT.jar
[ivy:resolve] 	==== maven2: tried
[ivy:resolve] 	  http://repo1.maven.org/maven2/org/apache/hadoop/hadoop-yarn-common/0.24.0-SNAPSHOT/hadoop-yarn-common-0.24.0-SNAPSHOT.pom
[ivy:resolve] 	  -- artifact org.apache.hadoop#hadoop-yarn-common;0.24.0-SNAPSHOT!hadoop-yarn-common.jar:
[ivy:resolve] 	  http://repo1.maven.org/maven2/org/apache/hadoop/hadoop-yarn-common/0.24.0-SNAPSHOT/hadoop-yarn-common-0.24.0-SNAPSHOT.jar
[ivy:resolve] 		::::::::::::::::::::::::::::::::::::::::::::::
[ivy:resolve] 		::          UNRESOLVED DEPENDENCIES         ::
[ivy:resolve] 		::::::::::::::::::::::::::::::::::::::::::::::
[ivy:resolve] 		:: org.apache.hadoop#hadoop-yarn-server-common;0.24.0-SNAPSHOT: not found
[ivy:resolve] 		:: org.apache.hadoop#hadoop-mapreduce-client-core;0.24.0-SNAPSHOT: not found
[ivy:resolve] 		:: org.apache.hadoop#hadoop-yarn-common;0.24.0-SNAPSHOT: not found
[ivy:resolve] 		::::::::::::::::::::::::::::::::::::::::::::::
[ivy:resolve] 
[ivy:resolve] :: USE VERBOSE OR DEBUG MESSAGE LEVEL FOR MORE DETAILS

BUILD FAILED
/home/jenkins/jenkins-slave/workspace/Hadoop-Mapreduce-trunk/trunk/hadoop-mapreduce-project/build.xml:2223:
impossible to resolve dependencies:
	resolve failed - see output for details

Total time: 36 seconds
Build step 'Execute shell' marked build as failure
[FINDBUGS] Skipping publisher since build result is FAILURE
Updating MAPREDUCE-2985
Updating MAPREDUCE-2675
Updating MAPREDUCE-2896
Updating HADOOP-7599
Updating MAPREDUCE-2874
Updating HADOOP-7568
Updating MAPREDUCE-2979
Updating MAPREDUCE-2669
Email was triggered for: Failure
Sending email for trigger: Failure



###################################################################################
############################## FAILED TESTS (if any) ##############################
No tests ran.

Mime
View raw message