hadoop-mapreduce-dev mailing list archives

Site index · List index
Message view « Date » · « Thread »
Top « Date » · « Thread »
From Ravi Teja <ravit...@huawei.com>
Subject Problem building yarn in trunk, which was working earlier.
Date Mon, 22 Aug 2011 15:58:35 GMT
Hi,

 

Everything was working fine till recently, where the dependency resolution
itself is failing.

Are there any changes done, I have executed the target which was working
earlier, which is mvn install assembly:assembly

Thanks in advance.

 

[INFO]
------------------------------------------------------------------------ 
[INFO] Building hadoop-yarn-api 1.0-SNAPSHOT 
[INFO]
------------------------------------------------------------------------ 
[INFO]
------------------------------------------------------------------------ 
[INFO] Reactor Summary: 
[INFO] 
[INFO] hadoop-yarn-api ................................... FAILURE [0.297s] 
[INFO] hadoop-yarn-common ................................ SKIPPED 
[INFO] hadoop-yarn-server-common ......................... SKIPPED 
[INFO] hadoop-yarn-server-nodemanager .................... SKIPPED 
[INFO] hadoop-yarn-server-resourcemanager ................ SKIPPED 
[INFO] hadoop-yarn-server-tests .......................... SKIPPED 
[INFO] hadoop-yarn-server ................................ SKIPPED 
[INFO] hadoop-yarn ....................................... SKIPPED 
[INFO] hadoop-mapreduce-client-core ...................... SKIPPED 
[INFO] hadoop-mapreduce-client-common .................... SKIPPED 
[INFO] hadoop-mapreduce-client-shuffle ................... SKIPPED 
[INFO] hadoop-mapreduce-client-app ....................... SKIPPED 
[INFO] hadoop-mapreduce-client-hs ........................ SKIPPED 
[INFO] hadoop-mapreduce-client-jobclient ................. SKIPPED 
[INFO] hadoop-mapreduce-client ........................... SKIPPED 
[INFO] hadoop-mapreduce .................................. SKIPPED 
[INFO]
------------------------------------------------------------------------ 
[INFO] BUILD FAILURE 
[INFO]
------------------------------------------------------------------------ 
[INFO] Total time: 0.672s 
[INFO] Finished at: Mon Aug 22 21:15:00 IST 2011 
[INFO] Final Memory: 4M/8M 
[INFO]
------------------------------------------------------------------------ 
[ERROR] Failed to execute goal on project hadoop-yarn-api: Could not resolve
dep 
endencies for project org.apache.hadoop:hadoop-yarn-api:jar:1.0-SNAPSHOT:
Failed 
 to collect dependencies for [org.apache.avro:avro:jar:1.4.1 (compile),
com.goog 
le.protobuf:protobuf-java:jar:2.4.0a (compile),
org.apache.hadoop:hadoop-common: 
jar:0.23.0-SNAPSHOT (compile),
org.apache.hadoop:hadoop-annotations:jar:0.23.0-S 
NAPSHOT (compile), junit:junit:jar:4.8.2 (compile),
org.mockito:mockito-all:jar: 
1.8.5 (test), org.apache.hadoop:hadoop-common:jar:tests:0.23.0-SNAPSHOT
(test), 
org.apache.hadoop:hadoop-hdfs:jar:0.23.0-SNAPSHOT (runtime),
com.google.inject.e 
xtensions:guice-servlet:jar:2.0 (compile),
org.jboss.netty:netty:jar:3.2.3.Final 
 (compile), org.slf4j:slf4j-api:jar:1.6.1 (compile),
org.slf4j:slf4j-log4j12:jar 
:1.6.1 (compile)]: Failed to read artifact descriptor for
org.apache.hadoop:hado 
op-common:jar:0.23.0-SNAPSHOT: Failure to find
org.apache.hadoop:hadoop-project- 
distro:pom:0.23.0-SNAPSHOT in  <http://repository.apache.org/snapshots>
http://repository.apache.org/snapshots was cached 
in the local repository, resolution will not be reattempted until the update
int 
erval of apache.snapshots has elapsed or updates are forced -> [Help 1]

 

Regards,

Ravi Teja

 


Mime
  • Unnamed multipart/alternative (inline, None, 0 bytes)
View raw message